Butanoic acid, 4-(2,4-dichlorophenoxy)-
- Formula: C10H10Cl2O3
- Molecular weight: 249.091
- IUPAC Standard InChIKey: YIVXMZJTEQBPQO-UHFFFAOYSA-N
- CAS Registry Number: 94-82-6
- Chemical structure:
View 3d structure (requires JavaScript / HTML 5) - Other names: Butyric acid, 4-(2,4-dichlorophenoxy)-; γ-(2,4-Dichlorophenoxy)butyric acid; (2,4-Dichlorophenoxy)butyric acid; Butyrac; Butyrac 118; Legumex; Legumex D; 2,4-DB; 2,4-DM; 4-(2,4-Dichlorophenoxy)butyric acid; Butoxone; Butyrac 200; 2,4-D butyric acid; 4-(2,4-DB); Butoxon; Butoxone ester; Butyrac ester; Kyselina 4-(2,4-dichlorfenoxy)maselna; 4-(2,4-Dichlorophenoxy)butanoic acid; Butirex; Butormone; Campbell's db straight; Venceweed; Buratal; NSC 70337; Sys 67 Buratal

Phase change data

Data compiled as indicated in comments:
TRC - Thermodynamics Research Center, NIST Boulder Laboratories, Chris Muzny director
AC - William E. Acree, Jr., James S. Chickos
Quantity | Value | Units | Method | Reference | Comment |
---|---|---|---|---|---|
Tfus | 391.49 | K | N/A | Donnelly, Drewes, et al., 1990 | Uncertainty assigned by TRC = 0.2 K; TRC |
Tfus | 390.9 | K | N/A | Plato and Glasgow, 1969 | Uncertainty assigned by TRC = 0.2 K; TRC |
Quantity | Value | Units | Method | Reference | Comment |
ΔsubH° | 124. ± 6. | kJ/mol | DSC | Vecchio and Brunetti, 2005 | AC |
ΔsubH° | 149. ± 2. | kJ/mol | TE | Vecchio and Brunetti, 2005 | Based on data from 356. to 391. K.; AC |
Enthalpy of sublimation
ΔsubH (kJ/mol) | Temperature (K) | Method | Reference | Comment |
---|---|---|---|---|
146. ± 1. | 374. | TE | Vecchio and Brunetti, 2005 | Based on data from 356. to 391. K.; AC |
Enthalpy of fusion
ΔfusH (kJ/mol) | Temperature (K) | Method | Reference | Comment |
---|---|---|---|---|
35.0 | 395.5 | DSC | Vecchio and Brunetti, 2005 | AC |
38.42 | 391.4 | N/A | Acree, 1991 | AC |

Normal alkane RI, non-polar column, temperature ramp

Column type | Active phase | I | Reference | Comment |
---|---|---|---|---|
Capillary | Ultra-1 | 1869. | Okumura, 1991 | 25. m/0.32 mm/0.25 μm, He, 3. K/min; Tstart: 80. C; Tend: 260. C |

References

Donnelly, Drewes, et al., 1990
Donnelly, J.R.; Drewes, L.A.; Johnson, R.L.; Munslow, W.D.; Knapp, K.K.; Sovocool, G.W.,
Purity and heat of fusion data for environmental standards as determined by differential scanning calorimetry,
Thermochim. Acta, 1990, 167, 2, 155, https://doi.org/10.1016/0040-6031(90)80476-F
. [all data]
Plato and Glasgow, 1969
Plato, C.; Glasgow, A.R., Jr.,
Differential scanning calorimetry as a general method for determining the purity and heat of fusion of high-purity organic chemicals. Application to 95 compounds,
Anal. Chem., 1969, 41, 2, 330, https://doi.org/10.1021/ac60271a041
. [all data]
Vecchio and Brunetti, 2005
Vecchio, Stefano; Brunetti, Bruno,
Standard Sublimation Enthalpies of Some Dichlorophenoxy Acids and Their Methyl Esters,
J. Chem. Eng. Data, 2005, 50, 2, 666-672, https://doi.org/10.1021/je049626l
. [all data]
Acree, 1991
Acree, William E.,
Thermodynamic properties of organic compounds: enthalpy of fusion and melting point temperature compilation,
Thermochimica Acta, 1991, 189, 1, 37-56, https://doi.org/10.1016/0040-6031(91)87098-H
. [all data]
Okumura, 1991
Okumura, T.,
retention indices of environmental chemicals on methyl silicone capillary column,
Journal of Environmental Chemistry (Japan), 1991, 1, 2, 333-358, https://doi.org/10.5985/jec.1.333
. [all data]