Dimethyl bicyclo[2.2.1]-2,5-heptadiene-2,3-dicarboxylate
- Formula: C11H12O4
- Molecular weight: 208.2106
- IUPAC Standard InChIKey: WFKWXJMEUOLYOS-UHFFFAOYSA-N
- CAS Registry Number: 947-57-9
- Chemical structure:
View 3d structure (requires JavaScript / HTML 5) - Other names: Bicyclo[2.2.1]hepta-2,5-diene-2,3-dicarboxylic acid, dimethyl ester; Dimethyl ester of 2,5-norbornadien-2,3-dicarboxylic acid; 2,5-Norbornadiene-2,3-dicarboxylic acid, dimethyl ester; Dimethyl bicyclo[2.2.1]hepta-2,5-diene-2,3-dicarboxylate; 2,3-Bis(methoxycarbonyl)norbornadiene; Dimethyl 2,5-norbornadiene-2,3-dicarboxylate; Dimethyl norbornadiene-2,3-dicarboxylate

Phase change data

Data compiled by: Robert L. Brown and Stephen E. Stein
Reduced pressure boiling point
Tboil (K) | Pressure (bar) | Reference |
---|---|---|
418. to 420. | 0.027 | Frinton Laboratories Inc., 1986 |

Reaction thermochemistry data

Data compiled by: Hussein Y. Afeefy, Joel F. Liebman, and Stephen E. Stein
Individual Reactions
By formula: C11H12O4 = C11H12O4
Quantity | Value | Units | Method | Reference | Comment |
---|---|---|---|---|---|
ΔrH° | -77. ± 1. | kJ/mol | Ciso | Kabakoff, Bunzli, et al., 1975 | solid phase; solvent: Toluene |

References

Frinton Laboratories Inc., 1986
Frinton Laboratories Inc.,
Catalog Number 11, Frinton Laboratories Inc., Vineland, NJ, 1986, 99. [all data]
Kabakoff, Bunzli, et al., 1975
Kabakoff, D.S.; Bunzli, J.-C.G.; Oth, J.F.M.; Hammond, W.B.; Berson, J.A.,
Enthalpy and kinetics of isomerization of quadricyclane to norbornadiene. Strain energy of quadricyclane,
J. Am. Chem. Soc., 1975, 97, 1510-1511. [all data]
Prinzbach and Schmidt, 1974
Prinzbach, H.; Schmidt, H.-G.,
Chem. Ber., 1974, 107, 1988. [all data]