[(4-Chloro-o-tolyl)oxy]acetic acid
- Formula: C9H9ClO3
- Molecular weight: 200.619
- IUPAC Standard InChIKey: WHKUVVPPKQRRBV-UHFFFAOYSA-N
- CAS Registry Number: 94-74-6
- Chemical structure:
View 3d structure (requires JavaScript / HTML 5) - Other names: Acetic acid, (4-chloro-2-methylphenoxy)-; Acetic acid, [(4-chloro-o-tolyl)oxy]-; (2-Methyl-4-chlorophenoxy)acetic acid; (4-Chloro-o-toloxy)acetic acid; (4-Chloro-2-methylphenoxy)acetic acid; Agroxon; Agroxone; Anicon kombi; Anicon M; B-Selektonon M; Dicopur-M; Emcepan; Hedapur M 52; Hedarex M; Hedonal M; Herbicide M; Leuna M; Mephanac; Methoxone; MCP; MCPA; Netazol; Okultin M; 2,4-MCPA; 2M-4Ch; 2M-4Kh; 2-(4-Chloro-2-methylphenoxy)acetic acid; (4-Chloro-o-cresoxy)acetic acid; Agritox; Bordermaster; Chiptox; Cornox-M; Dikotes; Dikotex; Hornotuho; Kilsem4k-2m; Krezone; Linormone; Metaxon; Raphone; Rhomenc; Rhomene; Rhonox; Trasan; Zelan; 2-Methyl-4-chlorphenoxyessigsaeure; Acme MCPA amine 4; BH MCPA; Brominal M & plus; Dicotex; Dow MCP amine weed killer; Empal; Hormotuho; Kilsem; 4K-2M; Kyselina 4-chlor-2-methylfenoxyoctova; Kwas 4-chloro-2-metylofenoksyoctowy; Legumex DB; Leyspray; M 40; 2M-4C; Phenoxylene 50; Phenoxylene plus; Phenoxylene super; Razol dock killer; Shamrox; Seppic MMD; Soviet technical herbicide 2M-4C; U 46 M-FLUID; Ustinex; Vacate; Vesakontuho MCPA; Verdone; Weedar mcpa concentrate; Weedone mcpa ester; Weed-rhap; Chwastox 30; Agricorn 500 II; Agritox 50; Albar-M; Atlas MCPA; Campbell's MCPA 25, 50; Cekherbex; Methyl chlorophenoxy acetic acid; Selektonon M; Weedar MCPA; Acetic acid, (4-chloro-o-toloxy)-; Acetic acid, 2-(4-chloro-2-methylphenoxy)-; Hormoneste; Mecaphar

Phase change data

Data compiled as indicated in comments:
TRC - Thermodynamics Research Center, NIST Boulder Laboratories, Chris Muzny director
AC - William E. Acree, Jr., James S. Chickos
Quantity | Value | Units | Method | Reference | Comment |
---|---|---|---|---|---|
Tfus | 393.44 | K | N/A | Donnelly, Drewes, et al., 1990 | Uncertainty assigned by TRC = 0.2 K; TRC |
Tfus | 392.7 | K | N/A | Plato, 1972 | Uncertainty assigned by TRC = 0.2 K; TRC |
Enthalpy of fusion
ΔfusH (kcal/mol) | Temperature (K) | Method | Reference | Comment |
---|---|---|---|---|
7.165 | 392.9 | DSC | Acree, 1991 | See also Donnelly, Drewes, et al., 1990, 2.; AC |

References

Donnelly, Drewes, et al., 1990
Donnelly, J.R.; Drewes, L.A.; Johnson, R.L.; Munslow, W.D.; Knapp, K.K.; Sovocool, G.W.,
Purity and heat of fusion data for environmental standards as determined by differential scanning calorimetry,
Thermochim. Acta, 1990, 167, 2, 155, https://doi.org/10.1016/0040-6031(90)80476-F
. [all data]
Plato, 1972
Plato, C.,
DSC as a general method for determining purity and heat of fusion of high-purity organic chemicals,
Anal. Chem., 1972, 44, 1531. [all data]
Acree, 1991
Acree, William E.,
Thermodynamic properties of organic compounds: enthalpy of fusion and melting point temperature compilation,
Thermochimica Acta, 1991, 189, 1, 37-56, https://doi.org/10.1016/0040-6031(91)87098-H
. [all data]
Donnelly, Drewes, et al., 1990, 2
Donnelly, J.R.; Drewes, L.A.; Johnson, R.L.; Munslow, W.D.; Knapp, K.K.; Sovocool, G.W.,
Purity and heat of fusion data for environmental standards as determined by differential scanning calorimetry,
Thermochimica Acta, 1990, 167, 2, 155-187, https://doi.org/10.1016/0040-6031(90)80476-F
. [all data]