4-cyano-2-fluorophenyl-4-butoxybenzoate
- Formula: C18H16FNO3
- Molecular weight: 313.3229
- CAS Registry Number: 94611-28-6

Phase change data

Data compiled by: Thermodynamics Research Center, NIST Boulder Laboratories, Chris Muzny director
Quantity | Value | Units | Method | Reference | Comment |
---|---|---|---|---|---|
Tfus | 357.7 | K | N/A | Kelly, 1984 | Uncertainty assigned by TRC = 0.2 K |

References

Kelly, 1984
Kelly, S.M.,
the synthesis and transition temperatures of benzoate ester derivatives of 2-fluoro-4-hydroxy- and 3-fluoro-4-hydro-4-hydroxybenzonitriles,
Helv. Chim. Acta, 1984, 67, 1572. [all data]