4-Cyano-3-fluorophenyl 4-pentoxybenzoate
- Formula: C19H18FNO3
- Molecular weight: 327.3495
- CAS Registry Number: 94610-84-1

Phase change data

Data compiled as indicated in comments:
TRC - Thermodynamics Research Center, NIST Boulder Laboratories, Chris Muzny director
AC - William E. Acree, Jr., James S. Chickos
Quantity | Value | Units | Method | Reference | Comment |
---|---|---|---|---|---|
Tfus | 341. | K | N/A | Kelly, 1984 | Uncertainty assigned by TRC = 1. K; TRC |
Enthalpy of fusion
ΔfusH (kJ/mol) | Temperature (K) | Method | Reference | Comment |
---|---|---|---|---|
37.7 | 341.2 | DSC | Kelly, 1984, 2 | AC |

References

Kelly, 1984
Kelly, S.M.,
the synthesis and transition temperatures of benzoate ester derivatives of 2-fluoro-4-hydroxy- and 3-fluoro-4-hydro-4-hydroxybenzonitriles,
Helv. Chim. Acta, 1984, 67, 1572. [all data]
Kelly, 1984, 2
Kelly, Stephen M.,
The synthesis and transition temperatures of benzoate ester derivatives of 2-fluoro-4-hydroxy-and 3-fluoro-4-hydroxybenzonitriles,
Helv. Chim. Acta, 1984, 67, 6, 1572-1579, https://doi.org/10.1002/hlca.19840670623
. [all data]