Safrole
- Formula: C10H10O2
- Molecular weight: 162.1852
- IUPAC Standard InChIKey: ZMQAAUBTXCXRIC-UHFFFAOYSA-N
- CAS Registry Number: 94-59-7
- Chemical structure:
View 3d structure (requires JavaScript / HTML 5) - Other names: 1,3-Benzodioxole, 5-(2-propenyl)-; Benzene, 4-allyl-1,2-(methylenedioxy)-; m-Allylpyrocatechin methylene ether; Allylcatechol methylene ether; Allylpyrocatechol methylene ether; Rhyuno oil; Safrene; Safrol; Safrole MF; Shikimole; Shikomol; 1-Allyl-3,4-(methylenedioxy)benzene; 3,4-(Methylenedioxy)allylbenzene; 4-Allyl-1,2-(methylenedioxy)benzene; 5-Allyl-1,3-benzodioxole; (1,2-(Methylenedioxy)-4-allyl)benzene; 1,3-Benzodioxole, 5-allyl-; 4-Allylpyrocatechol formaldehyde acetal; 5-(2-Propenyl)-1,3-benzodioxole; Benzene, 1,2-methylenedioxy-4-allyl-; Rcra waste number U203; 3-(3,4-Methylenedioxyphenyl)prop-1-ene; 1,3-Benzodioxole, 5-(2-propen-1-yl)-; Allyldioxybenzene methylene ether; NSC 11831

Phase change data

Data compiled as indicated in comments:
BS - Robert L. Brown and Stephen E. Stein
TRC - Thermodynamics Research Center, NIST Boulder Laboratories, Chris Muzny director
AC - William E. Acree, Jr., James S. Chickos
Quantity | Value | Units | Method | Reference | Comment |
---|---|---|---|---|---|
Tboil | 506.2 | K | N/A | Aldrich Chemical Company Inc., 1990 | BS |
Tboil | 504.6 to 505. | K | N/A | Buckingham and Donaghy, 1982 | BS |
Tboil | 509.05 | K | N/A | Lecat, 1947 | Uncertainty assigned by TRC = 1. K; TRC |
Tboil | 509.05 | K | N/A | Lecat, 1943 | Uncertainty assigned by TRC = 0.4 K; TRC |
Tboil | 509.1 | K | N/A | Lecat, 1927 | Uncertainty assigned by TRC = 0.5 K; TRC |
Reduced pressure boiling point
Tboil (K) | Pressure (bar) | Reference | Comment |
---|---|---|---|
377.7 | 0.008 | Weast and Grasselli, 1989 | BS |
377. to 378. | 0.008 | Buckingham and Donaghy, 1982 | BS |
Enthalpy of vaporization
ΔvapH (kJ/mol) | Temperature (K) | Method | Reference | Comment |
---|---|---|---|---|
54.6 | 351. | A | Stephenson and Malanowski, 1987 | Based on data from 336. to 506. K. See also Stull, 1947.; AC |
Antoine Equation Parameters
log10(P) = A − (B / (T + C))
P = vapor pressure (bar)
T = temperature (K)
View plot Requires a JavaScript / HTML 5 canvas capable browser.
Temperature (K) | A | B | C | Reference | Comment |
---|---|---|---|---|---|
336.9 to 506. | 5.39932 | 2627.831 | -19.348 | Stull, 1947 | Coefficents calculated by NIST from author's data. |

Kovats' RI, non-polar column, isothermal

Data compiled by: NIST Mass Spectrometry Data Center, William E. Wallace, director

Column type CapillaryCapillary
Active phase SE-30PB-1
Column length (m) 40.42.
Carrier gas
Substrate
Column diameter (mm) 0.350.32
Phase thickness (μm) 0.35
Temperature (C) 100.130.
I 1264.51275.
ReferenceTudor, 1997Engewald, Knobloch, et al., 1991
Comment MSDC-RI MSDC-RI

Kovats' RI, non-polar column, temperature ramp

View large format table.

Column type Active phase I Reference Comment
CapillaryBP-11262.Raina, Srivastava, et al., 200225. m/0.55 mm/0.25 μm, N2, 5. K/min, 220. C @ 15. min; Tstart: 60. C
CapillaryBP-11273.Jain, Srivastava, et al., 200125. m/0.55 mm/0.25 μm, N2, 5. K/min, 220. C @ 15. min; Tstart: 60. C
CapillaryBP-11275.Raina, Srivastava, et al., 200125. m/0.55 mm/0.25 μm, N2, 5. K/min, 220. C @ 15. min; Tstart: 60. C
CapillarySE-541285.Adams, 200030. m/0.26 mm/0.25 μm, He, 3. K/min; Tstart: 60. C; Tend: 246. C
CapillaryDB-51286.Adams, 2000, 230. m/0.26 mm/0.25 μm, He, 3. K/min; Tstart: 60. C; Tend: 246. C
CapillaryDB-51285.Adams, 199930. m/0.26 mm/0.25 μm, He, 3. K/min; Tstart: 60. C; Tend: 246. C
CapillaryDB-51285.Lopes, Kato, et al., 19993. K/min; Column length: 30. m; Column diameter: 0.25 mm; Tstart: 60. C; Tend: 240. C
CapillaryDB-51288.Lopes, Kato, et al., 19993. K/min; Column length: 30. m; Column diameter: 0.25 mm; Tstart: 60. C; Tend: 240. C
CapillaryDB-51288.da Silva, Andrade, et al., 199930. m/0.25 mm/0.25 μm, He, 3. K/min; Tstart: 60. C; Tend: 240. C
CapillaryBP-11273.Ekundayo, Laakso, et al., 1988H2, 65. C @ 2. min, 5. K/min; Column length: 50. m; Column diameter: 0.33 mm; Tend: 220. C

Kovats' RI, non-polar column, custom temperature program

View large format table.

Column type Active phase I Reference Comment
CapillaryBP-11257.Khan, Srivastava, et al., 200325. m/0.25 mm/0.25 μm, N2; Program: 60C => 5C/min => 220C (5min) => 3C/min => 245 C (5min)
CapillaryBP-11257.Khan, Srivastava, et al., 200230. m/0.32 mm/0.25 μm, N2; Program: 60 C 5 C/min -> 220 C (5 min) 3 C/min -> 245 C (5 min)
CapillaryDB-51283.Bizzo, Lopes, et al., 2001Program: not specified
CapillaryDB-51281.Andrade, Santos, et al., 199830. m/0.25 mm/0.25 μm, He; Program: 40C => 2C/min => 60C => 4C/min => 260C

Kovats' RI, polar column, temperature ramp

View large format table.

Column type Active phase I Reference Comment
CapillaryCarbowax 20M1903.Gaydou, Randriamiharisoa, et al., 198650. m/0.3 mm/0.15 μm, H2, 2. K/min; Tstart: 70. C; Tend: 210. C

Van Den Dool and Kratz RI, non-polar column, temperature ramp

View large format table.

Column type Active phase I Reference Comment
CapillaryBP-11261.Lesueur, de Rocca Serra, et al., 200750. m/0.22 mm/0.25 μm, He, 2. K/min, 220. C @ 20. min; Tstart: 60. C
CapillaryHP-5MS1293.2Zeng, Zhao, et al., 200730. m/0.25 mm/0.25 μm, He, 4. K/min; Tstart: 80. C; Tend: 300. C
CapillaryDB-51287.Su, Ho, et al., 200630. m/0.25 mm/0.25 μm, He, 50. C @ 2. min, 5. K/min; Tend: 250. C
CapillaryHP-5MS1291.4Zhao C.X., Li, et al., 200630. m/0.25 mm/0.25 μm, He, 4. K/min; Tstart: 80. C; Tend: 300. C
CapillaryDB-11289.bin Jantan, Yalvema, et al., 200525. m/0.25 mm/0.25 μm, 60. C @ 10. min, 3. K/min, 180. C @ 10. min
CapillaryDB-51285.bin Jantan, Yalvema, et al., 2005, 225. m/0.25 mm/0.25 μm, N2, 75. C @ 10. min, 3. K/min, 210. C @ 1. min
CapillaryHP-5MS1287.Pino, Mesa, et al., 200530. m/0.25 mm/0.25 μm, He, 60. C @ 2. min, 4. K/min, 250. C @ 20. min
CapillaryDB-51296.Zhang, Xu, et al., 200530. m/0.25 mm/0.25 μm, N2, 45. C @ 10. min, 2.5 K/min, 180. C @ 20. min
CapillaryDB-51286.Jantan, Ling, et al., 200330. m/0.25 mm/0.25 μm, He, 75. C @ 10. min, 3. K/min, 230. C @ 20. min
CapillarySE-301264.bin Jantan, Ayop, et al., 200225. m/0.25 mm/0.25 μm, N2, 60. C @ 10. min, 3. K/min, 180. C @ 10. min
CapillaryCP Sil 5 CB1265.Pino and Marbot, 200150. m/0.32 mm/0.4 μm, He, 60. C @ 10. min, 3. K/min, 280. C @ 60. min
CapillaryCP Sil 8 CB1288.Chevance and Farmer, 199960. C @ 5. min, 4. K/min, 220. C @ 30. min; Column length: 50. m; Column diameter: 0.32 mm
CapillaryMethyl Silicone1274.Sumathykutty, Rao, et al., 199950. m/0.25 mm/0.17 μm, N2, 2. K/min; Tstart: 80. C; Tend: 200. C
CapillaryBP-11270.Tam, An, et al., 199850. m/0.22 mm/0.25 μm, He, 2. K/min, 220. C @ 20. min; Tstart: 60. C

Van Den Dool and Kratz RI, non-polar column, custom temperature program

View large format table.

Column type Active phase I Reference Comment
Capillary5 % Phenyl methyl siloxane1287.Sacchetti, Maietti, et al., 200530. m/0.32 mm/0.15 μm, He; Program: 45C => 1C/min => 100C => 5C/min => 250C (10min)
CapillarySE-521293.Mondello, Dugo, et al., 199560. m/0.32 mm/0.40 μm, He; Program: 45 C (6 min) 3 C/min -> 111 0C 2 C/min -> 160 C 3 C/min -> 300 C (15 min)

Van Den Dool and Kratz RI, polar column, temperature ramp

View large format table.

Column type Active phase I Reference Comment
CapillaryBP-201874.Lesueur, de Rocca Serra, et al., 200750. m/0.22 mm/0.25 μm, He, 2. K/min, 220. C @ 20. min; Tstart: 60. C
CapillaryAT-Wax1865.Pino and Marbot, 200160. m/0.32 mm/0.25 μm, He, 65. C @ 10. min, 2. K/min, 250. C @ 60. min
CapillaryDB-Wax1872.Brophy, Goldsack, et al., 1999He, 3. K/min; Column length: 60. m; Column diameter: 0.53 mm; Tstart: 50. C; Tend: 220. C
CapillaryCP-Wax 52CB1853.Chevance and Farmer, 199960. C @ 5. min, 4. K/min, 220. C @ 30. min; Column length: 50. m; Column diameter: 0.32 mm
CapillaryCP-Wax 52CB1854.Chevance and Farmer, 1999, 260. C @ 5. min, 4. K/min, 220. C @ 30. min; Column length: 50. m; Column diameter: 0.32 mm
CapillaryCP-Wax 52CB1857.Chevance and Farmer, 1999, 240. C @ 5. min, 4. K/min, 220. C @ 30. min; Column length: 50. m; Column diameter: 0.32 mm
CapillaryCarbowax 20M1862.Mondello, Dugo, et al., 199560. m/0.32 mm/0.425 μm, He, 45. C @ 3. min, 3. K/min, 300. C @ 20. min
CapillaryDB-Wax1874.Shiratsuchi, Shimoda, et al., 199360. m/0.25 mm/0.25 μm, 50. C @ 4. min, 2. K/min, 230. C @ 30. min
CapillaryDB-Wax1874.Shiratsuchi, Shimoda, et al., 199360. m/0.25 mm/0.25 μm, 50. C @ 4. min, 2. K/min, 230. C @ 30. min

Normal alkane RI, non-polar column, temperature ramp

View large format table.

Column type Active phase I Reference Comment
CapillaryDP-51327.Vijayakumar, Duraipandiyan, et al., 201230. m/0.25 mm/0.25 μm, Helium, 80. C @ 1. min, 4. K/min, 300. C @ 40. min
CapillaryDP-51327.Vijayakumar, Duraipandiyan, et al., 201230. m/0.25 mm/0.25 μm, Helium, 80. C @ 1. min, 4. K/min, 300. C @ 40. min
CapillaryDB-51287.Ho, Wang, et al., 201030. m/0.25 mm/0.25 μm, Helium, 2. K/min; Tstart: 50. C; Tend: 250. C
CapillaryDB-5 MS1287.Silva, Pott, et al., 201030. m/0.25 mm/0.25 μm, Helium, 3. K/min; Tstart: 60. C; Tend: 240. C
CapillaryDB-51287.Ho, Wang, et al., 200930. m/0.25 mm/0.25 μm, Helium, 50. C @ 2. min, 5. K/min; Tend: 250. C
CapillaryHP-5 MS1289.Zhao, Zeng, et al., 200930. m/0.25 mm/0.25 μm, Helium, 4. K/min; Tstart: 50. C; Tend: 280. C
CapillaryHP-5 MS1286.Adams, Beauchamp, et al., 200730. m/0.25 mm/0.25 μm, Helium, 50. C @ 10. min, 3. K/min, 230. C @ 10. min
CapillaryDB-5MS1286.Da Silva J.K.R., Sousa P.J.C., et al., 200730. m/0.25 mm/0.25 μm, He, 3. K/min; Tstart: 60. C; Tend: 240. C
CapillaryDB-51278.Limberger, Scopel, et al., 200730. m/0.25 mm/0.25 μm, He, 3. K/min; Tstart: 60. C; Tend: 300. C
CapillaryZB-51296.Mohottalage, Tabacchi, et al., 200730. m/0.25 mm/0.25 μm, 60. C @ 5. min, 4. K/min, 220. C @ 20. min
CapillaryBP-11260.Boti, Muselli, et al., 200650. m/0.22 mm/0.25 μm, He, 2. K/min, 220. C @ 20. min; Tstart: 60. C
CapillaryDB-51285.Pino, Marbot, et al., 200630. m/0.25 mm/0.25 μm, Hydrogen, 70. C @ 4. min, 4. K/min; Tend: 280. C
CapillaryFSOT-RSL-2001285.Schmidt, Jirovetz, et al., 200630. m/0.32 mm/0.25 μm, Hydrogen, 40. C @ 5. min, 6. K/min, 280. C @ 5. min
CapillaryCP Sil 5 CB1267.Tesso, König, et al., 2006H2, 3. K/min; Column length: 25. m; Column diameter: 0.25 mm; Tstart: 50. C; Tend: 230. C
CapillarySPB-51285.Pino, Marbot, et al., 200530. m/0.25 mm/0.25 μm, He, 60. C @ 2. min, 4. K/min, 250. C @ 20. min
CapillaryDB-11289.bin Jantan, Ayop, et al., 200425. m/0.25 mm/0.25 μm, 60. C @ 10. min, 3. K/min, 180. C @ 10. min
CapillaryHP-51287.Simic, Sokovic, et al., 200425. m/0.32 mm/0.52 μm, H2, 4. K/min; Tstart: 40. C; Tend: 240. C
CapillaryDB-51287.Tirillini, Pellegrino, et al., 200430. m/0.25 mm/0.25 μm, He, 3. K/min; Tstart: 60. C; Tend: 300. C
CapillaryDB-51286.da Silva, Luz, et al., 200330. m/0.25 mm/0.25 μm, He, 3. K/min; Tstart: 60. C; Tend: 240. C
CapillaryDB-5MS1284.Taveira, de Lima, et al., 200330. m/0.25 mm/0.25 μm, He, 3. K/min; Tstart: 60. C; Tend: 240. C
CapillaryRSL-2001280.Jirovetz, Buchbauer, et al., 200230. m/0.32 mm/0.25 μm, H2, 40. C @ 5. min, 6. K/min, 280. C @ 5. min
CapillaryDB-51286.Maia, da Silva, et al., 200230. m/0.25 mm/0.25 μm, He, 3. K/min; Tstart: 60. C; Tend: 240. C
CapillaryDB-5MS1287.Maia, Zoghbi, et al., 200230. m/0.25 mm/0.25 μm, He, 3. K/min; Tstart: 60. C; Tend: 240. C
CapillaryDB-51287.Zoghbi, Andrade, et al., 200230. m/0.25 mm/0.25 μm, He, 3. K/min; Tstart: 60. C; Tend: 240. C
CapillaryDB-51290.Maia, Zoghbi, et al., 200030. m/0.25 mm/0.25 μm, He, 3. K/min; Tstart: 60. C; Tend: 240. C
CapillarySE-301286.Ali N.A.M. and Jantan, 1999He, 3. K/min; Column length: 25. m; Column diameter: 0.2 mm; Tstart: 60. C; Tend: 230. C
CapillarySPB-11264.Choo, Wong, et al., 199950. m/0.2 mm/0.33 μm, 4. K/min; Tstart: 60. C; Tend: 260. C
CapillaryHP-11267.Lopes, Koketsu, et al., 199925. m/0.32 mm/0.17 μm, H2, 40. C @ 5. min, 3. K/min; Tend: 260. C
CapillaryOV-1011295.Menon, Chacko, et al., 1999N2, 1. K/min, 200. C @ 20. min; Column length: 50. m; Column diameter: 0.2 mm; Tstart: 80. C
CapillaryDB-51291.Meynier, Novelli, et al., 199930. m/0.32 mm/1. μm, 40. C @ 5. min, 3. K/min; Tend: 200. C
CapillarySE-301286.Mohd and Jantan, 1999He, 60. C @ 10. min, 3. K/min; Column length: 25. m; Column diameter: 0.2 mm; Tend: 230. C
CapillaryDB-5MS1290.Zoghbi, Andrade, et al., 199930. m/0.25 mm/0.25 μm, He, 3. K/min; Tstart: 60. C; Tend: 240. C
CapillaryDB-51285.Maia, Zohhbi, et al., 199830. m/0.25 mm/0.25 μm, He, 3. K/min; Tstart: 60. C; Tend: 240. C
CapillaryHP-11259.Thanh, Dung, et al., 199625. m/0.32 mm/0.25 μm, Helium, 60. C @ 2. min, 4. K/min, 220. C @ 20. min
CapillaryOV-1011278.Egolf and Jurs, 19932. K/min; Column length: 50. m; Column diameter: 0.22 mm; Tstart: 80. C; Tend: 200. C
CapillaryCP Sil 8 CB1293.Jantan and Goh, 199060. C @ 10. min, 3. K/min; Column length: 25. m; Column diameter: 0.20 mm; Tend: 230. C

Normal alkane RI, non-polar column, custom temperature program

View large format table.

Column type Active phase I Reference Comment
CapillaryRTX-51289.Zachariah, Leela, et al., 200830. m/0.25 mm/0.25 μm, Helium; Program: 60 0C (5 min) 5 0C/min -> 110 0C 3 0C/min -> 220 0C (5 min)
CapillaryRTX-51287.Zachariah, Leela, et al., 200830. m/0.25 mm/0.25 μm, Helium; Program: not specified
CapillaryHP-5MS1283.Cole, Haber, et al., 200730. m/0.25 mm/0.25 μm, He; Program: 40C(10min) => 3C/min => 200C => 2C/min => 220C
CapillarySE-521287.Tognolini, Barocelli, et al., 200630. m/0.32 mm/0.15 μm, He; Program: 45C => 1C/min => 100C => 5C/min => 250C (10min)
CapillarySE-301278.Vinogradov, 2004Program: not specified
CapillaryHP-5MS1287.Ansorena, Gimeno, et al., 200130. m/0.25 mm/0.25 μm, He; Program: 40C (10min) => 3C/min => 120C => 10C/min => 250C (5min)
CapillaryDB-51284.Andrade, Maia, et al., 200030. m/0.25 mm/0.25 μm, He; Program: 40C => 2C/min => 60C => 4C/min => 260C
CapillaryCP Sil 5 CB1267.Weyerstahl, Marschall, et al., 199925. m/0.25 mm/0.39 μm, N2; Program: not specified
CapillaryCP Sil 5 CB1269.Weyerstahl, Marschall, et al., 1998N2; Column length: 25. m; Program: not specified
CapillaryMethyl Silicone1266.Grundschober, 1991Program: not specified
CapillaryOV-1011278.Shibamoto, 1987Program: not specified

Normal alkane RI, polar column, temperature ramp

View large format table.

Column type Active phase I Reference Comment
CapillaryBP-201872.Boti, Muselli, et al., 200650. m/0.22 mm/0.25 μm, He, 2. K/min, 220. C @ 20. min; Tstart: 60. C
CapillaryDB-Wax1863.Lee, Umano, et al., 200530. m/0.25 mm/0.25 μm, He, 3. K/min, 180. C @ 40. min; Tstart: 50. C
CapillarySupelcowax-101871.Choo, Wong, et al., 199930. m/0.25 mm/0.25 μm, 4. K/min; Tstart: 60. C; Tend: 220. C
CapillaryTC-Wax1885.Shuichi, Masazumi, et al., 199680. C @ 5. min, 3. K/min; Column length: 60. m; Column diameter: 0.25 mm; Tend: 240. C
CapillaryCarbowax 20M1876.Egolf and Jurs, 19932. K/min; Column length: 80. m; Column diameter: 0.2 mm; Tstart: 70. C; Tend: 170. C
CapillaryDB-Wax1873.Shimoda, Shiratsuchi, et al., 199360. m/0.25 mm/0.25 μm, He, 50. C @ 4. min, 2. K/min; Tend: 230. C

Normal alkane RI, polar column, custom temperature program

View large format table.

Column type Active phase I Reference Comment
CapillaryPEG-20M Innowax1878.Wang, Tian, et al., 201330. m/0.25 mm/0.25 μm, Nitrogen; Program: 50 0C (7 min) 20 0C/min -> 130 0C (1 min) 1 0C/min -> 150 0C 8 0C/min -> 190 0C (5 min)
CapillaryDB-Wax1863.Tian, Zhang, et al., 200730. m/0.25 mm/0.25 μm, He; Program: 50 0C (2 min) 6 0C/min -> 150 0C 8 0C/min -> 230 0C (15 min)
CapillaryCarbowax 20M1876.Vinogradov, 2004Program: not specified
CapillaryPolyethylene Glycol1869.Grundschober, 1991Program: not specified
CapillaryCarbowax 20M1876.Shibamoto, 1987Program: not specified

Lee's RI, non-polar column, temperature ramp

View large format table.

Column type Active phase I Reference Comment
CapillaryDB-5MS218.98Chen, Keeran, et al., 200230. m/0.25 mm/0.5 μm, 40. C @ 1. min, 10. K/min; Tend: 310. C
CapillaryDB-5MS219.88Chen, Keeran, et al., 200230. m/0.25 mm/0.5 μm, 40. C @ 1. min, 4. K/min; Tend: 310. C

References

Aldrich Chemical Company Inc., 1990
Aldrich Chemical Company Inc.,
Catalog Handbook of Fine Chemicals, Aldrich Chemical Company, Inc., Milwaukee WI, 1990, 1. [all data]
Buckingham and Donaghy, 1982
Buckingham, J.; Donaghy, S.M.,
Dictionary of Organic Compounds: Fifth Edition, Chapman and Hall, New York, 1982, 1. [all data]
Lecat, 1947
Lecat, M.,
Some azeotropes of which one constituant is heterocyclic nitrogen,
Ann. Soc. Sci. Bruxelles, Ser. 1, 1947, 61, 73. [all data]
Lecat, 1943
Lecat, M.,
Azeotropes of Ethyl Urethane and other Azeotropes,
C. R. Hebd. Seances Acad. Sci., 1943, 217, 273. [all data]
Lecat, 1927
Lecat, M.,
New binary azeotropes: 6th list,
Ann. Soc. Sci. Bruxelles, Ser. B, 1927, 47, 63-71. [all data]
Weast and Grasselli, 1989
CRC Handbook of Data on Organic Compounds, 2nd Editon, Weast,R.C and Grasselli, J.G., ed(s)., CRC Press, Inc., Boca Raton, FL, 1989, 1. [all data]
Stephenson and Malanowski, 1987
Stephenson, Richard M.; Malanowski, Stanislaw,
Handbook of the Thermodynamics of Organic Compounds, 1987, https://doi.org/10.1007/978-94-009-3173-2
. [all data]
Stull, 1947
Stull, Daniel R.,
Vapor Pressure of Pure Substances. Organic and Inorganic Compounds,
Ind. Eng. Chem., 1947, 39, 4, 517-540, https://doi.org/10.1021/ie50448a022
. [all data]