1,3-Benzodioxole, 5-propyl-
- Formula: C10H12O2
- Molecular weight: 164.2011
- IUPAC Standard InChIKey: MYEIDJPOUKASEC-UHFFFAOYSA-N
- CAS Registry Number: 94-58-6
- Chemical structure:
View 3d structure (requires JavaScript / HTML 5) - Other names: Benzene, 1,2-(methylenedioxy)-4-propyl-; [1,2-(Methylenedioxy)-4-propyl]benzene; Dihydrosafrol; Dihydrosafrole; 2',3'-Dihydrosafrole; 5-Propyl-1,3-benzodioxole; 1-(3,4-Methylenedioxyphenyl)propane; Safrole, dihydro-; 4-Propyl-1,2-(methylenedioxy)benzene; Rcra waste number U090; NSC 27867

Phase change data

Data compiled by: Robert L. Brown and Stephen E. Stein
Reduced pressure boiling point
Tboil (K) | Pressure (bar) | Reference |
---|---|---|
387. to 388. | 0.024 | Frinton Laboratories Inc., 1986 |

Normal alkane RI, non-polar column, custom temperature program

Column type | Active phase | I | Reference | Comment |
---|---|---|---|---|
Capillary | SE-30 | 1286. | Vinogradov, 2004 | Program: not specified |
Capillary | OV-101 | 1286. | Shibamoto, 1987 | Program: not specified |

Normal alkane RI, polar column, custom temperature program

Column type | Active phase | I | Reference | Comment |
---|---|---|---|---|
Capillary | Carbowax 20M | 1822. | Vinogradov, 2004 | Program: not specified |
Capillary | Carbowax 20M | 1822. | Shibamoto, 1987 | Program: not specified |

References

Frinton Laboratories Inc., 1986
Frinton Laboratories Inc.,
Catalog Number 11, Frinton Laboratories Inc., Vineland, NJ, 1986, 99. [all data]
Vinogradov, 2004
Vinogradov, B.A.,
Production, composition, properties and application of essential oils, 2004, retrieved from http://viness.narod.ru. [all data]
Shibamoto, 1987
Shibamoto, T.,
Retention Indices in Essential Oil Analysis
in Capillary Gas Chromatography in Essential Oil Analysis, Sandra, P.; Bicchi, C., ed(s)., Hutchig Verlag, Heidelberg, New York, 1987, 259-274. [all data]