(1R,3aS,4aS,8aS)-1,4,4,6-Tetramethyl-1,2,3,3a,4,4a,7,8-octahydrocyclopenta[1,4]cyclobuta[1,2]benzene

Van Den Dool and Kratz RI, polar column, temperature ramp

Data compiled by: NIST Mass Spectrometry Data Center, William E. Wallace, director

Column type CapillaryCapillaryCapillaryCapillaryCapillary
Active phase RTX-WaxBP-20RTX-WaxBP-20BP-20
Column length (m) 60.50.60.50.50.
Carrier gas HeHeHeHeHe
Substrate
Column diameter (mm) 0.220.220.220.220.22
Phase thickness (μm) 0.250.250.250.250.25
Tstart (C) 60.60.60.60.60.
Tend (C) 230.220.230.230.230.
Heat rate (K/min) 2.2.2.2.2.
Initial hold (min)
Final hold (min) 45.20.35.35.35.
I 1543.1542.1517.1536.1536.
ReferenceCavalli, Tomi, et al., 2006Duquesnoy, Dinh, et al., 2006Paolini J., Desjobert J.M., et al., 2006Bianchini, Tomi, et al., 2003Bianchini, Tomi, et al., 2003
Comment MSDC-RI MSDC-RI MSDC-RI MSDC-RI MSDC-RI
Column type Capillary
Active phase BP-20
Column length (m) 50.
Carrier gas He
Substrate
Column diameter (mm) 0.22
Phase thickness (μm) 0.25
Tstart (C) 60.
Tend (C) 230.
Heat rate (K/min) 2.
Initial hold (min)
Final hold (min) 35.
I 1536.
ReferenceBianchini, Tomi, et al., 2001
Comment MSDC-RI

Normal alkane RI, non-polar column, custom temperature program

Data compiled by: NIST Mass Spectrometry Data Center, William E. Wallace, director

Column type CapillaryCapillaryCapillaryCapillaryCapillary
Active phase HP-5 MSHP-5 MSHP-5HP-5HP-5MS
Column length (m)   25.25.30.
Carrier gas   HeliumHeliumHe
Substrate
Column diameter (mm)   0.320.320.25
Phase thickness (μm)   0.170.170.25
Program not specifiednot specified60 0C (5 min) 4 0C/min -> 220 0C 11 0C/min -> 280 0C (15 min)not specified40C(10min) => 3C/min => 200C => 2C/min => 220C
I 1403.1404.1407.1405.1402.
ReferencePayo, Colo, et al., 2011Payo, Colo, et al., 2011Custer, 2009Custer, 2009Cole, Haber, et al., 2007
Comment MSDC-RI MSDC-RI MSDC-RI MSDC-RI MSDC-RI
Column type CapillaryCapillary
Active phase CP Sil 8 CBDB-5
Column length (m) 50.30.
Carrier gas HeHe
Substrate
Column diameter (mm) 0.320.25
Phase thickness (μm) 0.250.25
Program 60C(2min) => 5C/min => 160C(1min) => 10C/min => 250C (5min)60C(4min) => 6C/min => 240 => 10C/min => 280C
I 1401.1406.
ReferenceJudpentienë and Mockutë, 2004Letchamo, Ward, et al., 2004
Comment MSDC-RI MSDC-RI

Van Den Dool and Kratz RI, non-polar column, custom temperature program

Data compiled by: NIST Mass Spectrometry Data Center, William E. Wallace, director

Column type CapillaryCapillary
Active phase HP-5MSBPX-5
Column length (m) 30.30.
Carrier gas He
Substrate
Column diameter (mm) 0.250.25
Phase thickness (μm) 0.250.25
Program 60C (1 min) => 5 C/min => 210C => 10 C/min => 280C (15 min)35C(5min) => 3C/min => 210C => 40C/min => 240C (4min)
I 1414.61420.
ReferenceAndriamaharavo, 2014Cardeal, da Silva, et al., 2006
Comment MSDC-RI MSDC-RI

References

Cavalli, Tomi, et al., 2006
Cavalli, J.-F.; Tomi, F.; Bernardini, A.-F.; Casanova, J., Chemical variability of the essential oil of Helichrysum faradifani Sc. Ell. from Madagascar, Flavour Fragr. J., 2006, 21, 1, 111-114, https://doi.org/10.1002/ffj.1531 . [all data]

Duquesnoy, Dinh, et al., 2006
Duquesnoy, E.; Dinh, N.H.; Castola, V.; Casanova, J., Composition of a Pyrolytic oil from Cupressus funebris Endl. of Vietnamese origin, Flavour Fragr. J., 2006, 21, 3, 453-457, https://doi.org/10.1002/ffj.1676 . [all data]

Paolini J., Desjobert J.M., et al., 2006
Paolini J.; Desjobert J.M.; Costa J.; Bernardini A.F.; Castellini C.B.; Cioni P.L.; Flamini G.; Morelli I., Composition of essential oils of Helichrysum italicum (Roth) G. Don fil subsp. italicum from Tuscan archipelago islands, Flavour Fragr. J., 2006, 21, 5, 805-808, https://doi.org/10.1002/ffj.1726 . [all data]

Bianchini, Tomi, et al., 2003
Bianchini, A.; Tomi, P.; Bernardini, A.F.; Morelli, I.; Flamini, G.; Cioni, P.L.; Usai, M.; Marchetti, M., A comparative study of volatile constituents of two Helichrysum italicum (Roth) Guss. Don Fil subspecies growing in Corsica (France), Tuscany and Sardinia (Italy), Flavour Fragr. J., 2003, 18, 6, 487-491, https://doi.org/10.1002/ffj.1231 . [all data]

Bianchini, Tomi, et al., 2001
Bianchini, A.; Tomi, P.; Costa, J.; Bernardini, A.F., Composition of Helichrysum italicum (Roth) G. Don fil. subsp. italicum essential oils from Corsica (France), Flavour Fragr. J., 2001, 16, 1, 30-34, https://doi.org/10.1002/1099-1026(200101/02)16:1<30::AID-FFJ941>3.0.CO;2-F . [all data]