Phenol, 2,6-dimethoxy-, acetate
- Formula: C10H12O4
- Molecular weight: 196.1999
- IUPAC Standard InChIKey: CIIHIFFNYMLOAV-UHFFFAOYSA-N
- CAS Registry Number: 944-99-0
- Chemical structure:
View 3d structure (requires JavaScript / HTML 5) - Other names: 2-Acetyl-1,3-dimethylpyrogallol; 2,6-Dimethoxyphenylacetate; Acetic acid, 2,6-dimethoxyphenyl ester

Van Den Dool and Kratz RI, non-polar column, temperature ramp

Column type | Active phase | I | Reference | Comment |
---|---|---|---|---|
Capillary | VF-5MS | 1482. | Todua, 2011 | 30. m/0.25 mm/0.25 μm, He; Tstart: 60. C; Tend: 270. C |
Capillary | 5 % Phenyl methyl siloxane | 1503. | Zaikin, 2010 | 30. m/0.25 mm/0.25 μm, 15. K/min, 270. C @ 15. min; Tstart: 60. C |

References

Todua, 2011
Todua, N.G.,
Retention Data. NIST Mass Spectrometry Data Center., NIST Mass Spectrometry Data Center, 2011. [all data]
Zaikin, 2010
Zaikin, V.G.,
Personal communication: Retention indices measured during 2010, 2010. [all data]