Chalcone
- Formula: C15H12O
- Molecular weight: 208.2552
- IUPAC Standard InChIKey: DQFBYFPFKXHELB-UHFFFAOYSA-N
- CAS Registry Number: 94-41-7
- Chemical structure:
- Other names: 2-Propen-1-one, 1,3-diphenyl-; α-Benzylideneacetophenone; β-Benzoylstyrene; β-Phenylacrylophenone; Benzalacetophenone; Benzylideneacetophenone; Benzylidenacetophenone; Chalkone; Cinnamophenone; Phenyl styryl ketone; 1-Phenyl-2-benzoylethylene; 1,3-Diphenyl-1-propen-3-one; 2-Benzalacetophenone; 2-Benzylideneacetophenone; 3-Phenylacrylophenone; 1,3-Diphenyl-2-propen-1-one; Acrylophenone, 3-phenyl-; 1-Benzoyl-2-phenylethene; 1,3-Diphenylpropenone; Phenyl 2-phenylvinyl ketone; Styryl phenyl ketone; 1-Benzoyl-2-phenylethylene; ω-Benzylideneacetophenone; 1,3-Diphenyl-2-propenone; NSC 26612

Condensed phase thermochemistry data

Data compiled by: Hussein Y. Afeefy, Joel F. Liebman, and Stephen E. Stein
Quantity | Value | Units | Method | Reference | Comment |
---|---|---|---|---|---|
ΔfH°solid | -24. | kJ/mol | Ccb | Moureu, 1930 | |
Quantity | Value | Units | Method | Reference | Comment |
ΔcH°solid | -7626.2 | kJ/mol | Ccb | Moureu, 1930 | Corresponding ΔfHºsolid = 8.4 kJ/mol (simple calculation by NIST; no Washburn corrections) |

Phase change data

Data compiled by: Thermodynamics Research Center, NIST Boulder Laboratories, Chris Muzny director
Quantity | Value | Units | Method | Reference | Comment |
---|---|---|---|---|---|
Tfus | 329. | K | N/A | Kern, Shriner, et al., 1925 | Uncertainty assigned by TRC = 4. K |

Reaction thermochemistry data

Data compiled by: Hussein Y. Afeefy, Joel F. Liebman, and Stephen E. Stein
Individual Reactions
By formula: C7H6O + C8H8O = H2O + C15H12O
Quantity | Value | Units | Method | Reference | Comment |
---|---|---|---|---|---|
ΔrH° | -65.0 ± 1.9 | kJ/mol | Cm | Hao, Chang, et al., 1985 | liquid phase; solvent: Aqueous NaOH |

Van Den Dool and Kratz RI, non-polar column, temperature ramp

Column type | Active phase | I | Reference | Comment |
---|---|---|---|---|
Capillary | SE-54 | 1970.6 | Shapi and Hesso, 1990 | 25. m/0.32 mm/0.15 μm, He, 40. C @ 1. min, 5. K/min, 280. C @ 15. min |

References

Moureu, 1930
Moureu, M.H.,
Des sur la tautomerie des dicetones α,
Ann. Chem., 1930, 14, 283-405. [all data]
Kern, Shriner, et al., 1925
Kern, J.W.; Shriner, R.L.; Adams, R.,
Platinum and Palladium Oxides as Catalysts in the Reduction of Organic Compounds IX. The Reduction of Olefins,
J. Am. Chem. Soc., 1925, 47, 1147. [all data]
Hao, Chang, et al., 1985
Hao, J.; Chang, J.; Wang, K.; Liu, Y.; Zhong, G.,
Heat of reaction of chalcone by calorimetric measurement,
Huaxue Tongbao, 1985, 15-16. [all data]
Shapi and Hesso, 1990
Shapi, M.M.; Hesso, A.,
Thermal decomposition of polystyrene volatile compounds from large-scale pyrolysis,
J. Anal. Appl. Pyrolysis, 1990, 18, 2, 143-161, https://doi.org/10.1016/0165-2370(90)80004-8
. [all data]