1,5-Diphenylbicyclo[3.2.0]heptane
- Formula: C19H22
- Molecular weight: 250.3780
- IUPAC Standard InChIKey: ITJCELKBMFHZCC-UHFFFAOYSA-N
- CAS Registry Number: 94383-67-2
- Chemical structure:

Gas phase thermochemistry data

Data compiled by: Hussein Y. Afeefy, Joel F. Liebman, and Stephen E. Stein
Quantity | Value | Units | Method | Reference | Comment |
---|---|---|---|---|---|
ΔfH°gas | 215. | kJ/mol | Kin | Roth, Lennartz, et al., 1990 | Thermal Isomerization |

References

Roth, Lennartz, et al., 1990
Roth, W.R.; Lennartz, H.-W.; Doering, W.E.,
A "frustrated" Cope rearrangement: thermal interconversion of 2,6-diphenylhhepta-1,6-diene and 1,5-diphenylbicyclo[3.2.0]heptane,
J. Am. Chem. Soc., 1990, 112, 1722-1732. [all data]