4-cyano-2-fluorophenyl-trans-4-pentylcyclohexane-1- carboxylate

Phase change data

Data compiled by: Thermodynamics Research Center, NIST Boulder Laboratories, Chris Muzny director

Quantity Value Units Method Reference Comment
Tfus348.7KN/AKelly and Schad, 1984Nemactic liquid crystal phase; Uncertainty assigned by TRC = 0.2 K

In addition to the Thermodynamics Research Center (TRC) data available from this site, much more physical and chemical property data is available from the following TRC products:

References

Kelly and Schad, 1984
Kelly, S.M.; Schad, H., the synthesis and transition temperatures of ester derivatives of 2-fluoro-4-hydroxy- and 3-fluoro-4-hydroxybenzonitriles also incorporating aliphatic ring systems, Helv. Chim. Acta, 1984, 67, 1580. [all data]