Butamben
- Formula: C11H15NO2
- Molecular weight: 193.2423
- IUPAC Standard InChIKey: IUWVALYLNVXWKX-UHFFFAOYSA-N
- CAS Registry Number: 94-25-7
- Chemical structure:

Phase change data

Data compiled as indicated in comments:
BS - Robert L. Brown and Stephen E. Stein
TRC - Thermodynamics Research Center, NIST Boulder Laboratories, Chris Muzny director
AC - William E. Acree, Jr., James S. Chickos
Quantity | Value | Units | Method | Reference | Comment |
---|---|---|---|---|---|
Tfus | 331. | K | N/A | Neau, Flynn, et al., 1989 | Uncertainty assigned by TRC = 0.5 K; TRC |
Tfus | 330. to 332. | K | N/A | Buckingham and Donaghy, 1982 | BS |
Tfus | 329. | K | N/A | Schwartz and Paruta, 1976 | Uncertainty assigned by TRC = 0.5 K; TRC |
Tfus | 329. | K | N/A | Yalkowsky, Flynn, et al., 1972 | Uncertainty assigned by TRC = 1. K; TRC |
Reduced pressure boiling point
Tboil (K) | Pressure (atm) | Reference | Comment |
---|---|---|---|
446.7 | 0.01 | Weast and Grasselli, 1989 | BS |
447. | 0.01 | Buckingham and Donaghy, 1982 | BS |
Enthalpy of fusion
ΔfusH (kcal/mol) | Temperature (K) | Method | Reference | Comment |
---|---|---|---|---|
5.71 | 330.6 | DSC | Schmidt, 2005 | AC |
4.890 | 331.1 | N/A | Acree, 1991 | AC |

Normal alkane RI, non-polar column, isothermal

Column type | Active phase | Temperature (C) | I | Reference | Comment |
---|---|---|---|---|---|
Capillary | JXR | 180. | 1759. | von Buchi, Lorini, et al., 1972 | |
Capillary | JXR | 200. | 1758. | von Buchi, Lorini, et al., 1972 |

References

Neau, Flynn, et al., 1989
Neau, S.H.; Flynn, G.L.; Yalkowsky, S.H.,
Int. J. Pharm., 1989, 49, 223. [all data]
Buckingham and Donaghy, 1982
Buckingham, J.; Donaghy, S.M.,
Dictionary of Organic Compounds: Fifth Edition, Chapman and Hall, New York, 1982, 1. [all data]
Schwartz and Paruta, 1976
Schwartz, P.A.; Paruta, A.N.,
Solution thermodynamics of alkyl p-aminobenzoates,
J. Pharm. Sci., 1976, 65, 252. [all data]
Yalkowsky, Flynn, et al., 1972
Yalkowsky, S.H.; Flynn, G.L.; Slunick, T.G.,
Importance of chain length on physicochemical and crystalline properties of organic homologs,
J. Pharm. Sci., 1972, 61, 852. [all data]
Weast and Grasselli, 1989
CRC Handbook of Data on Organic Compounds, 2nd Editon, Weast,R.C and Grasselli, J.G., ed(s)., CRC Press, Inc., Boca Raton, FL, 1989, 1. [all data]
Schmidt, 2005
Schmidt, A.C.,
Structural characteristics and crystal polymorphism of three local anaesthetic bases,
International Journal of Pharmaceutics, 2005, 298, 1, 186-197, https://doi.org/10.1016/j.ijpharm.2005.04.025
. [all data]
Acree, 1991
Acree, William E.,
Thermodynamic properties of organic compounds: enthalpy of fusion and melting point temperature compilation,
Thermochimica Acta, 1991, 189, 1, 37-56, https://doi.org/10.1016/0040-6031(91)87098-H
. [all data]
von Buchi, Lorini, et al., 1972
von Buchi, J.; Lorini, V.; Perlia, X.,
Gaschromatographische Untersuchung einiger homologer Reihen von Lokalanaesthetica,
Pharm. Acta Helv., 1972, 47, 65, 377-393. [all data]