Tetracaine

Van Den Dool and Kratz RI, non-polar column, temperature ramp

Data compiled by: NIST Mass Spectrometry Data Center, William E. Wallace, director

Column type CapillaryCapillaryCapillaryPacked
Active phase SPB-1DB-1DB-1SE-30
Column length (m) 30.15.15.1.8
Carrier gas HeHeHeN2
Substrate    Chromosorb W
Column diameter (mm) 0.750.320.25
Phase thickness (μm) 1.00.250.25
Tstart (C) 160.120.120.130.
Tend (C) 280.280.280.290.
Heat rate (K/min) 10.8.8.8.
Initial hold (min)    2.
Final hold (min) 12.5.5.8.
I 2221.2212.2212.2215.
ReferenceChrist, Noomano, et al., 1988Perrigo, Peel, et al., 1985Perrigo, Ballantyne, et al., 1984Perrigo and Peel, 1981
Comment MSDC-RI MSDC-RI MSDC-RI MSDC-RI

References

Christ, Noomano, et al., 1988
Christ, D.W.; Noomano, P.; Rosas, M.; Rhone, D., Retention indices by wide-bore capillary gas chromatography with nitrogen-phosphorus detection, J. Anal. Toxicol., 1988, 12, 2, 84-88, https://doi.org/10.1093/jat/12.2.84 . [all data]

Perrigo, Peel, et al., 1985
Perrigo, B.J.; Peel, H.W.; Ballantyne, D.J., Use of Dual-Column Fused-Silica Capillary Gas Chromatography in Combination with Detector Response Factors for Analytical Toxicology., J. Chromatogr., 1985, 341, 81-88, https://doi.org/10.1016/S0378-4347(00)84011-6 . [all data]

Perrigo, Ballantyne, et al., 1984
Perrigo, B.J.; Ballantyne, D.J.; Peel, H.W., Condierations in developing a data base for drugs on a DBI capillary column, J. Can. Soc. Forensic Sci., 1984, 17, 2, 41-49, https://doi.org/10.1080/00085030.1984.10757360 . [all data]

Perrigo and Peel, 1981
Perrigo, B.J.; Peel, H.W., The use of retention indices and temperature-programmed gas chromatography in analytical toxicology, J. Chromatogr. Sci., 1981, 19, 5, 219-226, https://doi.org/10.1093/chromsci/19.5.219 . [all data]