7-Oxabicyclo[2.2.1]hept-5-ene-2,3-dicarboxylic anhydride, 1-methyl-, exo
- Formula: C9H8O4
- Molecular weight: 180.1574
- IUPAC Standard InChIKey: CFLSTTHDYSASGE-UHFFFAOYSA-N
- CAS Registry Number: 941-63-9
- Chemical structure:
View 3d structure (requires JavaScript / HTML 5) - Permanent link for this species. Use this link for bookmarking this species for future reference.

Reaction thermochemistry data

Data compiled by: Hussein Y. Afeefy, Joel F. Liebman, and Stephen E. Stein
Individual Reactions
By formula: C4H2O3 + C5H6O = C9H8O4
Quantity | Value | Units | Method | Reference | Comment |
---|---|---|---|---|---|
ΔrH° | -58.5 | kJ/mol | Cm | Balbi, 1991 | liquid phase; solvent: Dioxane |
ΔrH° | -60. | kJ/mol | Cm | Sparks and Poling, 1983 | solid phase; solvent: Dioxane |

References

Balbi, 1991
Balbi, N.,
Dynamic calorimetry in the study of Diels-Alder reaction,
Calorim. Anal. Therm., 1991, 22, 299-304. [all data]
Sparks and Poling, 1983
Sparks, B.G.; Poling, B.E.,
Energy storage capacity of reversible liquid-phase Diels Alder reaction between maleic anhydride and 2-methyl furan,
Am. Inst. Chem. Eng. Symp. Ser. (AIChE Symp. Ser.), 1983, 29, 534-537. [all data]