1H-Indene, 2,3-dihydro-1,1,4,6-tetramethyl-
- Formula: C13H18
- Molecular weight: 174.2820
- IUPAC Standard InChIKey: PJPNYZCIGFQVQG-UHFFFAOYSA-N
- CAS Registry Number: 941-60-6
- Chemical structure:
View 3d structure (requires JavaScript / HTML 5) - Other names: Indan, 1,1,4,6-tetramethyl-; 2,3-Dihydro-1,1,4,6-tetramethyl-1H-indene

Gas phase thermochemistry data

Data compiled by: Donald R. Burgess, Jr.
Quantity | Value | Units | Method | Reference | Comment |
---|---|---|---|---|---|
ΔfH°gas | -16.8 ± 0.67 | kcal/mol | N/A | Good, 1971 | Value computed using ΔfHliquid° value of -131.8±2.8 kj/mol from Good, 1971 and ΔvapH° value of 61.37±0.47 kj/mol from missing citation. |

Condensed phase thermochemistry data

Data compiled as indicated in comments:
ALS - Hussein Y. Afeefy, Joel F. Liebman, and Stephen E. Stein
DH - Eugene S. Domalski and Elizabeth D. Hearing
Quantity | Value | Units | Method | Reference | Comment |
---|---|---|---|---|---|
ΔfH°liquid | -31.51 ± 0.67 | kcal/mol | Ccb | Good, 1971 | ALS |
Quantity | Value | Units | Method | Reference | Comment |
ΔcH°liquid | -1805.99 ± 0.65 | kcal/mol | Ccb | Good, 1971 | Corresponding ΔfHºliquid = -31.51 kcal/mol (simple calculation by NIST; no Washburn corrections); ALS |
Quantity | Value | Units | Method | Reference | Comment |
S°liquid | 83.17 | cal/mol*K | N/A | Lee-Bechtold, Finke, et al., 1981 | DH |
Constant pressure heat capacity of liquid
Cp,liquid (cal/mol*K) | Temperature (K) | Reference | Comment |
---|---|---|---|
71.61 | 298.15 | Lee-Bechtold, Finke, et al., 1981 | T = 10 to 400 K.; DH |

Phase change data

Data compiled as indicated in comments:
TRC - Thermodynamics Research Center, NIST Boulder Laboratories, Chris Muzny director
ALS - Hussein Y. Afeefy, Joel F. Liebman, and Stephen E. Stein
AC - William E. Acree, Jr., James S. Chickos
DH - Eugene S. Domalski and Elizabeth D. Hearing
Quantity | Value | Units | Method | Reference | Comment |
---|---|---|---|---|---|
Ttriple | 273.51 | K | N/A | Lee-Bechtold, Finke, et al., 1981, 2 | Crystal phase 1 phase; Uncertainty assigned by TRC = 0.02 K; TRC |
Quantity | Value | Units | Method | Reference | Comment |
ΔvapH° | 14.67 ± 0.11 | kcal/mol | V | Osborn and Scott, 1978 | ALS |
ΔvapH° | 14.7 ± 0.1 | kcal/mol | EB,IP | Osborn and Scott, 1978, 2 | Based on data from 313. to 469. K.; AC |
Enthalpy of vaporization
ΔvapH (kcal/mol) | Temperature (K) | Method | Reference | Comment |
---|---|---|---|---|
14.2 | 328. | A,EB,IP | Stephenson and Malanowski, 1987 | Based on data from 313. to 383. K. See also Osborn and Scott, 1978, 2.; AC |
14.4 | 328. | A,EB,IP | Stephenson and Malanowski, 1987 | Based on data from 313. to 469. K. See also Osborn and Scott, 1978, 2.; AC |
12.4 | 439. | A,EB,IP | Stephenson and Malanowski, 1987 | Based on data from 423. to 469. K. See also Osborn and Scott, 1978, 2.; AC |
Enthalpy of fusion
ΔfusH (kcal/mol) | Temperature (K) | Reference | Comment |
---|---|---|---|
3.762 | 273.6 | Acree, 1991 | AC |
Temperature of phase transition
Ttrs (K) | Initial Phase | Final Phase | Reference | Comment |
---|---|---|---|---|
191. | crystaline, II | crystaline, I | Lee-Bechtold, Finke, et al., 1981 | DH |
Enthalpy of phase transition
ΔHtrs (kcal/mol) | Temperature (K) | Initial Phase | Final Phase | Reference | Comment |
---|---|---|---|---|---|
3.7624 | 273.51 | crystaline, I | liquid | Lee-Bechtold, Finke, et al., 1981 | DH |

Van Den Dool and Kratz RI, non-polar column, temperature ramp

Column type | Active phase | I | Reference | Comment |
---|---|---|---|---|
Capillary | Petrocol DH | 1293. | White, Hackett, et al., 1992 | 100. m/0.25 mm/0.5 μm, He, 1. K/min; Tstart: 30. C; Tend: 220. C |

Normal alkane RI, non-polar column, temperature ramp

Column type | Active phase | I | Reference | Comment |
---|---|---|---|---|
Capillary | SPB-5 | 1350. | Pino, Marbot, et al., 2002 | 30. m/0.25 mm/0.25 μm, Helium, 60. C @ 2. min, 4. K/min, 250. C @ 20. min |

References

Good, 1971
Good, W.D.,
The enthalpies of combustion and formation of indan and seven alkylindans,
J. Chem. Thermodyn., 1971, 3, 711-717. [all data]
Lee-Bechtold, Finke, et al., 1981
Lee-Bechtold, S.H.; Finke, H.L.; Messerly, J.F.; Scott, D.W.,
Thermodynamic properties of methyl-substituted indans,
J. Chem. Thermodyn., 1981, 13, 213-228. [all data]
Lee-Bechtold, Finke, et al., 1981, 2
Lee-Bechtold, S.H.; Finke, H.L.; Messerly, J.F.; Scott, D.W.,
Thermodynamic properties of methyl-substitued indans,
J. Chem. Thernodyn., 1981, 13, 213-28. [all data]
Osborn and Scott, 1978
Osborn, A.G.; Scott, D.W.,
J. Chem. Thermodyn., 1978, 10, 619. [all data]
Osborn and Scott, 1978, 2
Osborn, A.G.; Scott, D.W.,
Vapor-pressure and enthalpy of vaporization of indan and five methyl-substituted indans,
The Journal of Chemical Thermodynamics, 1978, 10, 7, 619-628, https://doi.org/10.1016/0021-9614(78)90102-7
. [all data]
Stephenson and Malanowski, 1987
Stephenson, Richard M.; Malanowski, Stanislaw,
Handbook of the Thermodynamics of Organic Compounds, 1987, https://doi.org/10.1007/978-94-009-3173-2
. [all data]
Acree, 1991
Acree, William E.,
Thermodynamic properties of organic compounds: enthalpy of fusion and melting point temperature compilation,
Thermochimica Acta, 1991, 189, 1, 37-56, https://doi.org/10.1016/0040-6031(91)87098-H
. [all data]
White, Hackett, et al., 1992
White, C.M.; Hackett, J.; Anderson, R.R.; Kail, S.; Spock, P.S.,
Linear temperature programmed retention indices of gasoline range hydrocarbons and chlorinated hydrocarbons on cross-linked polydimethylsiloxane,
J. Hi. Res. Chromatogr., 1992, 15, 2, 105-120, https://doi.org/10.1002/jhrc.1240150211
. [all data]
Pino, Marbot, et al., 2002
Pino, J.A.; Marbot, R.; Vazquez, C.,
Characterization of volatiles in Loquat fruit (Eriobotrya japonica Lindl.),
Revista CENIC Ciencias Quimicas, 2002, 33, 3, 115-119. [all data]