Isobutamben
- Formula: C11H15NO2
- Molecular weight: 193.2423
- IUPAC Standard InChIKey: PUYOAVGNCWPANW-UHFFFAOYSA-N
- CAS Registry Number: 94-14-4
- Chemical structure:

Phase change data

Data compiled by: William E. Acree, Jr., James S. Chickos
Enthalpy of fusion
ΔfusH (kJ/mol) | Temperature (K) | Method | Reference |
---|---|---|---|
10.7 | 327.8 | DSC | Schmidt, 2005 |

Van Den Dool and Kratz RI, non-polar column, temperature ramp

Column type | Active phase | I | Reference | Comment |
---|---|---|---|---|
Capillary | VF-5MS | 1769. | Todua, 2011 | 30. m/0.25 mm/0.25 μm, He; Tstart: 60. C; Tend: 270. C |

Normal alkane RI, non-polar column, custom temperature program

Column type | Active phase | I | Reference | Comment |
---|---|---|---|---|
Other | Methyl Silicone | 1795. | Ardrey and Moffat, 1981 | Program: not specified |

References

Schmidt, 2005
Schmidt, A.C.,
Structural characteristics and crystal polymorphism of three local anaesthetic bases,
International Journal of Pharmaceutics, 2005, 298, 1, 186-197, https://doi.org/10.1016/j.ijpharm.2005.04.025
. [all data]
Todua, 2011
Todua, N.G.,
Retention Data. NIST Mass Spectrometry Data Center., NIST Mass Spectrometry Data Center, 2011. [all data]
Ardrey and Moffat, 1981
Ardrey, R.E.; Moffat, A.C.,
Gas-liquid chromatographic retention indices of 1318 substances of toxicological interest on SE-30 or OV-1 stationary phase,
J. Chromatogr., 1981, 220, 3, 195-252, https://doi.org/10.1016/S0021-9673(00)81925-1
. [all data]