2-Butenoic acid, 2-methyl-, 4-methylpentyl ester, (E)-
- Formula: C11H20O2
- Molecular weight: 184.2753
- IUPAC Standard InChIKey: IGQMPEJHZCJCHT-BJMVGYQFSA-N
- CAS Registry Number: 94135-07-6
- Chemical structure:
- Other names: (E)-4-Methylpentyl 2-methylbut-2-enoate; 4-methylpentyl 2-methylcrotonate

Van Den Dool and Kratz RI, non-polar column, custom temperature program

Column type | Active phase | I | Reference | Comment |
---|---|---|---|---|
Capillary | HP-5MS | 1287.8 | Andriamaharavo, 2014 | 30. m/0.25 mm/0.25 μm, He; Program: 60C (1 min) => 5 C/min => 210C => 10 C/min => 280C (15 min) |

References

Andriamaharavo, 2014
Andriamaharavo, N.R.,
Retention Data. NIST Mass Spectrometry Data Center., NIST Mass Spectrometry Data Center, 2014. [all data]