Ethyl 4-methylbenzoate
- Formula: C10H12O2
- Molecular weight: 164.2011
- IUPAC Standard InChIKey: NWPWRAWAUYIELB-UHFFFAOYSA-N
- CAS Registry Number: 94-08-6
- Chemical structure:
View 3d structure (requires JavaScript / HTML 5) - Other names: Ethyl p-toluate; p-Toluic acid ethyl ester; Benzoic acid, 4-methyl-, ethyl ester; Ethyl p-methylbenzoate; p-Toluylic acid, ethyl ester

Phase change data

Data compiled as indicated in comments:
BS - Robert L. Brown and Stephen E. Stein
TRC - Thermodynamics Research Center, NIST Boulder Laboratories, Chris Muzny director
Quantity | Value | Units | Method | Reference | Comment |
---|---|---|---|---|---|
Tboil | 508.9 | K | N/A | Weast and Grasselli, 1989 | BS |
Tboil | 508.65 | K | N/A | Perkin, 1896 | Uncertainty assigned by TRC = 1. K; TRC |
Reduced pressure boiling point
Tboil (K) | Pressure (bar) | Reference | Comment |
---|---|---|---|
383.2 | 0.016 | Weast and Grasselli, 1989 | BS |

Kovats' RI, non-polar column, isothermal

Column type | Active phase | Temperature (C) | I | Reference | Comment |
---|---|---|---|---|---|
Packed | SE-30 | 180. | 1288. | Oszczapowicz, Osek, et al., 1985 | N2, Chromosorb A AW; Column length: 3. m |

Van Den Dool and Kratz RI, non-polar column, custom temperature program

Column type | Active phase | I | Reference | Comment |
---|---|---|---|---|
Capillary | 5 % Phenyl methyl siloxane | 1296.9 | Zaikin, 2003 | Column length: 30. m; Column diameter: 0.19 mm; Program: 50 C to 120 C at 5 C/min; 120 C to 290 C at 12 C/min |

Normal alkane RI, non-polar column, custom temperature program

Column type | Active phase | I | Reference | Comment |
---|---|---|---|---|
Capillary | Methyl Silicone | 1288. | Zenkevich and Kuznetsova, 1990 | Program: not specified |

References

Weast and Grasselli, 1989
CRC Handbook of Data on Organic Compounds, 2nd Editon, Weast,R.C and Grasselli, J.G., ed(s)., CRC Press, Inc., Boca Raton, FL, 1989, 1. [all data]
Perkin, 1896
Perkin, W.H.,
LXIX. On Magnetic Rotatory Power, especially of Aromatic Compounds,
J. Chem. Soc., 1896, 69, 1025-1257. [all data]
Oszczapowicz, Osek, et al., 1985
Oszczapowicz, J.; Osek, J.; Ciszkowski, K.; Krawczyk, W.; Ostrowski, M.,
Retention Indices of Dimethylbenzamidines and Benzylideneamines on a Non-Polar Column,
J. Chromatogr., 1985, 330, 79-85, https://doi.org/10.1016/S0021-9673(01)81964-6
. [all data]
Zaikin, 2003
Zaikin, V.G.,
Personal Communication: Retention indices measured during the period 2001 to 2003, 2003. [all data]
Zenkevich and Kuznetsova, 1990
Zenkevich, I.G.; Kuznetsova, L.M.,
Logic Criteria on Prediction of Gas Chromatographic Retention Indices from Physico-Chemical Properties of Organic Compounds,
Dokl. Akad. Nauk SSSR, 1990, 315, 4, 881-885. [all data]