1,3-Phenylenedibenzoate
- Formula: C20H14O4
- Molecular weight: 318.3228
- IUPAC Standard InChIKey: SUQGLJRNDJRARS-UHFFFAOYSA-N
- CAS Registry Number: 94-01-9
- Chemical structure:
View 3d structure (requires JavaScript / HTML 5) - Other names: Resorcinol dibenzoate; 1,3-Dibenzoyloxybenzene; 1,3-Benzenediol, dibenzoate; 1,3-Bis(benzoyloxy)benzene; 3-(Benzoyloxy)phenyl benzoate; m-phenylene dibenzoate; Dibenzoyl resorcinol

Phase change data

Data compiled by: William E. Acree, Jr., James S. Chickos
Enthalpy of vaporization
ΔvapH (kcal/mol) | Temperature (K) | Method | Reference | Comment |
---|---|---|---|---|
18.2 | 414. | A,UV | Stephenson and Malanowski, 1987 | Based on data from 399. to 493. K. See also Schmitt and Hirt, 1960. |
Enthalpy of sublimation
ΔsubH (kcal/mol) | Temperature (K) | Method | Reference | Comment |
---|---|---|---|---|
39.63 | 338. | A | Stephenson and Malanowski, 1987 | Based on data from 323. to 399. K. |

References

Stephenson and Malanowski, 1987
Stephenson, Richard M.; Malanowski, Stanislaw,
Handbook of the Thermodynamics of Organic Compounds, 1987, https://doi.org/10.1007/978-94-009-3173-2
. [all data]
Schmitt and Hirt, 1960
Schmitt, Richard G.; Hirt, Robert C.,
Investigation of the protective ultraviolet absorbers in a space environment. I. Rate of evaporation and vapor pressure studies,
J. Polym. Sci., 1960, 45, 145, 35-47, https://doi.org/10.1002/pol.1960.1204514504
. [all data]