Cyclopropanecarbonyl chloride, 2-phenyl-, trans-
- Formula: C10H9ClO
- Molecular weight: 180.631
- IUPAC Standard InChIKey: SODZBMGDYKEZJG-DTWKUNHWSA-N
- CAS Registry Number: 939-87-7
- Chemical structure:
View 3d structure (requires JavaScript / HTML 5) - Other names: trans-2-Phenylcyclopropane-1-carboxylic acid chloride; Cyclopropanecarbonyl chloride, 2-phenyl-, (E)-; 2-Phenylcyclopropanecarbonyl chloride, trans-; trans-2-Phenyl-1-cyclopropanecarbonyl chloride; 2-Phenylcyclopropanecarbonyl chloride; trans-2-phenylcyclopropanecarbonyl chloride

Phase change data

Data compiled by: Robert L. Brown and Stephen E. Stein
Reduced pressure boiling point
Tboil (K) | Pressure (bar) | Reference |
---|---|---|
382.2 | 0.003 | Weast and Grasselli, 1989 |

Van Den Dool and Kratz RI, non-polar column, custom temperature program

Column type | Active phase | I | Reference | Comment |
---|---|---|---|---|
Capillary | VF-5MS | 1415. | Tretyakov, 2011 | 30. m/0.25 mm/0.25 μm, He; Program: Multi-step temperature program; T(initial)=60C; T(final)=270C |

References

Weast and Grasselli, 1989
CRC Handbook of Data on Organic Compounds, 2nd Editon, Weast,R.C and Grasselli, J.G., ed(s)., CRC Press, Inc., Boca Raton, FL, 1989, 1. [all data]
Tretyakov, 2011
Tretyakov, K.V.,
Retention Data. NIST Mass Spectrometry Data Center., NIST Mass Spectrometry Data Center, 2011. [all data]