Benzamide, N-phenyl-
- Formula: C13H11NO
- Molecular weight: 197.2325
- IUPAC Standard InChIKey: ZVSKZLHKADLHSD-UHFFFAOYSA-N
- CAS Registry Number: 93-98-1
- Chemical structure:

Phase change data

Data compiled as indicated in comments:
BS - Robert L. Brown and Stephen E. Stein
TRC - Thermodynamics Research Center, NIST Boulder Laboratories, Chris Muzny director
AC - William E. Acree, Jr., James S. Chickos
DH - Eugene S. Domalski and Elizabeth D. Hearing
Quantity | Value | Units | Method | Reference | Comment |
---|---|---|---|---|---|
Tfus | 433. | K | N/A | Lumsden, 1905 | Uncertainty assigned by TRC = 3. K; TRC |
Quantity | Value | Units | Method | Reference | Comment |
ΔsubH° | 125.4 ± 2.3 | kJ/mol | C | Matos, Miranda, et al., 2006 | AC |
Reduced pressure boiling point
Tboil (K) | Pressure (bar) | Reference | Comment |
---|---|---|---|
390.2 | 0.013 | Aldrich Chemical Company Inc., 1990 | BS |
Enthalpy of sublimation
ΔsubH (kJ/mol) | Temperature (K) | Method | Reference | Comment |
---|---|---|---|---|
99.2 | 360.5 | A | Stephenson and Malanowski, 1987 | Based on data from 352. to 369. K. See also Aihara, 1960.; AC |
Enthalpy of fusion
ΔfusH (kJ/mol) | Temperature (K) | Method | Reference | Comment |
---|---|---|---|---|
29.610 | 436.49 | N/A | Sabbah and El Watik, 1992 | DH |
32.4 | 436.3 | DSC | Matos, Miranda, et al., 2006 | AC |
29.61 | 436.5 | N/A | Domalski and Hearing, 1996 | AC |

Reaction thermochemistry data

Data compiled by: Hussein Y. Afeefy, Joel F. Liebman, and Stephen E. Stein

Individual Reactions

Benzoyl iodide + Aniline = Hydrogen iodide + Benzamide, N-phenyl-

By formula: C7H5IO + C6H7N = HI + C13H11NO

Quantity Value Units Method Reference Comment
Δr-166. ± 2.kJ/molCacKiselev, Khuzyasheva, et al., 1979liquid phase; solvent: Benzene

Benzoyl bromide + Aniline = Hydrogen bromide + Benzamide, N-phenyl-

By formula: C7H5BrO + C6H7N = HBr + C13H11NO

Quantity Value Units Method Reference Comment
Δr-162. ± 0.8kJ/molCacKiselev, Khuzyasheva, et al., 1979liquid phase; solvent: Benzene

Aniline + Benzoyl chloride = Hydrogen chloride + Benzamide, N-phenyl-

By formula: C6H7N + C7H5ClO = HCl + C13H11NO

Quantity Value Units Method Reference Comment
Δr-149. ± 0.8kJ/molCacKiselev, Khuzyasheva, et al., 1979liquid phase; solvent: Benzene

References

Lumsden, 1905
Lumsden, J.S.,
The physical properties of heptoic, hexahydrobenzoic, and benzoic acids and their derivatives,
J. Chem. Soc., 1905, 87, 90-98. [all data]
Matos, Miranda, et al., 2006
Matos, M.A.R.; Miranda, M.S.; Morais, V.M.F.; Liebman, J.F.,
Benzanilide: on the crossroads of calorimetry, computations and concepts,
Molecular Physics, 2006, 104, 18, 2855-2860, https://doi.org/10.1080/00268970600845870
. [all data]
Aldrich Chemical Company Inc., 1990
Aldrich Chemical Company Inc.,
Catalog Handbook of Fine Chemicals, Aldrich Chemical Company, Inc., Milwaukee WI, 1990, 1. [all data]
Stephenson and Malanowski, 1987
Stephenson, Richard M.; Malanowski, Stanislaw,
Handbook of the Thermodynamics of Organic Compounds, 1987, https://doi.org/10.1007/978-94-009-3173-2
. [all data]
Aihara, 1960
Aihara, Ariyuki,
Estimation of the Energy of Hydrogen Bonds Formed in Crystals. III. Amides,
Bull. Chem. Soc. Jpn., 1960, 33, 9, 1188-1194, https://doi.org/10.1246/bcsj.33.1188
. [all data]
Sabbah and El Watik, 1992
Sabbah, R.; El Watik, L.,
New reference materials for the calibration (temperature and energy) of differential thermal analysers and scanning calorimeters,
J. Therm. Anal., 1992, 38(4), 855-863. [all data]
Domalski and Hearing, 1996
Domalski, Eugene S.; Hearing, Elizabeth D.,
Heat Capacities and Entropies of Organic Compounds in the Condensed Phase. Volume III,
J. Phys. Chem. Ref. Data, 1996, 25, 1, 1, https://doi.org/10.1063/1.555985
. [all data]