Benzoic acid, anhydride
- Formula: C14H10O3
- Molecular weight: 226.2274
- IUPAC Standard InChIKey: CHIHQLCVLOXUJW-UHFFFAOYSA-N
- CAS Registry Number: 93-97-0
- Chemical structure:
View 3d structure (requires JavaScript / HTML 5) - Other names: Benzoic anhydride; Benzoyl anhydride; Benzoyl benzoate

Gas phase thermochemistry data

Data compiled by: Hussein Y. Afeefy, Joel F. Liebman, and Stephen E. Stein
Quantity | Value | Units | Method | Reference | Comment |
---|---|---|---|---|---|
ΔfH°gas | -319. ± 4.6 | kJ/mol | Ccb | Carson, Fine, et al., 1971 |

Condensed phase thermochemistry data

Data compiled by: Hussein Y. Afeefy, Joel F. Liebman, and Stephen E. Stein
Quantity | Value | Units | Method | Reference | Comment |
---|---|---|---|---|---|
ΔfH°solid | -415. ± 2. | kJ/mol | Ccb | Carson, Fine, et al., 1971 | |
ΔfH°solid | -430.9 ± 6.7 | kJ/mol | Ccb | Breitenbach and Derkosch, 1951 | Reanalyzed by Cox and Pilcher, 1970, Original value = -430.1 kJ/mol |
Quantity | Value | Units | Method | Reference | Comment |
ΔcH°solid | -6523. ± 2. | kJ/mol | Ccb | Carson, Fine, et al., 1971 | Corresponding ΔfHºsolid = -415. kJ/mol (simple calculation by NIST; no Washburn corrections) |
ΔcH°solid | -6507.4 ± 6.7 | kJ/mol | Ccb | Breitenbach and Derkosch, 1951 | Reanalyzed by Cox and Pilcher, 1970, Original value = -6507.0 kJ/mol; Corresponding ΔfHºsolid = -430.91 kJ/mol (simple calculation by NIST; no Washburn corrections) |

Phase change data

Data compiled as indicated in comments:
BS - Robert L. Brown and Stephen E. Stein
TRC - Thermodynamics Research Center, NIST Boulder Laboratories, Chris Muzny director
AC - William E. Acree, Jr., James S. Chickos
ALS - Hussein Y. Afeefy, Joel F. Liebman, and Stephen E. Stein
Quantity | Value | Units | Method | Reference | Comment |
---|---|---|---|---|---|
Tboil | 633.2 | K | N/A | Weast and Grasselli, 1989 | BS |
Tboil | 633. | K | N/A | Buckingham and Donaghy, 1982 | BS |
Tboil | 633.2 | K | N/A | Lumsden, 1905 | Uncertainty assigned by TRC = 3. K; TRC |
Quantity | Value | Units | Method | Reference | Comment |
Tfus | 315. | K | N/A | Buckingham and Donaghy, 1982 | BS |
Tfus | 316.3 | K | N/A | Paetzold and Aurich, 1962 | Uncertainty assigned by TRC = 1. K; for the stable crystal; TRC |
Tfus | 315. | K | N/A | Adams, Wirth, et al., 1918 | Uncertainty assigned by TRC = 2. K; TRC |
Tfus | 315. | K | N/A | Lumsden, 1905 | Uncertainty assigned by TRC = 2. K; TRC |
Quantity | Value | Units | Method | Reference | Comment |
ΔsubH° | 96.2 ± 4.2 | kJ/mol | B | Carson, Fine, et al., 1971, 2 | See also Pedley and Rylance, 1977.; AC |
ΔsubH° | 96.2 ± 4.2 | kJ/mol | V | Carson, Fine, et al., 1971 | ALS |
Enthalpy of vaporization
ΔvapH (kJ/mol) | Temperature (K) | Method | Reference | Comment |
---|---|---|---|---|
69.1 | 431. | A | Stephenson and Malanowski, 1987 | Based on data from 416. to 633. K. See also Stull, 1947.; AC |
Antoine Equation Parameters
log10(P) = A − (B / (T + C))
P = vapor pressure (bar)
T = temperature (K)
View plot Requires a JavaScript / HTML 5 canvas capable browser.
Temperature (K) | A | B | C | Reference | Comment |
---|---|---|---|---|---|
417.0 to 633. | 4.93042 | 2887.848 | -46.935 | Stull, 1947 | Coefficents calculated by NIST from author's data. |
Enthalpy of fusion
ΔfusH (kJ/mol) | Temperature (K) | Reference | Comment |
---|---|---|---|
17.15 | 313.2 | Carson, Fine, et al., 1971, 2 | AC |

Van Den Dool and Kratz RI, non-polar column, custom temperature program

Column type | Active phase | I | Reference | Comment |
---|---|---|---|---|
Capillary | VF-5MS | 1953.4 | Tret'yakov, 2007 | 30. m/0.25 mm/0.25 μm, He; Program: Multi-step temperature program; T(initial)=60C; T(final)=270C |

References

Carson, Fine, et al., 1971
Carson, A.S.; Fine, D.H.; Gray, P.; Laye, P.G.,
Standard enthalpies of formation of diphenyl oxalate and benzoic anhydride and some related bond dissociation energies,
J. Chem. Soc. B, 1971, 1611-1615. [all data]
Breitenbach and Derkosch, 1951
Breitenbach, J.W.; Derkosch, J.,
Verbrennungswarmen von peroxyden und verwandten verbindungen sowie von polystrolen,
Monatsh. Chem., 1951, 82, 177-179. [all data]
Cox and Pilcher, 1970
Cox, J.D.; Pilcher, G.,
Thermochemistry of Organic and Organometallic Compounds, Academic Press, New York, 1970, 1-636. [all data]
Weast and Grasselli, 1989
CRC Handbook of Data on Organic Compounds, 2nd Editon, Weast,R.C and Grasselli, J.G., ed(s)., CRC Press, Inc., Boca Raton, FL, 1989, 1. [all data]
Buckingham and Donaghy, 1982
Buckingham, J.; Donaghy, S.M.,
Dictionary of Organic Compounds: Fifth Edition, Chapman and Hall, New York, 1982, 1. [all data]
Lumsden, 1905
Lumsden, J.S.,
The physical properties of heptoic, hexahydrobenzoic, and benzoic acids and their derivatives,
J. Chem. Soc., 1905, 87, 90-98. [all data]
Paetzold and Aurich, 1962
Paetzold, R.; Aurich, K.,
Polymorphism ob Benzoic Anhydride,
Chem. Ber., 1962, 95, 2645-51. [all data]
Adams, Wirth, et al., 1918
Adams, R.; Wirth, W.N.; French, H.E.,
Oxalyl Chloride As A Reagent in Organic Chemistry II. Preparation of Aromatic Acid Anhydrides; Reaction with Alcohols,
J. Am. Chem. Soc., 1918, 40, 424-31. [all data]
Carson, Fine, et al., 1971, 2
Carson, A.S.; Fine, D.H.; Gray, P.; Laye, P.G.,
Standard enthalpies of formation of diphenyl oxalate and benzoic anhydride and some related bond dissociation energies,
J. Chem. Soc., B:, 1971, 1611, https://doi.org/10.1039/j29710001611
. [all data]
Pedley and Rylance, 1977
Pedley, J.B.; Rylance, J.,
, Computer Analysed Thermochemical Data: Organic and Organometallic Compounds, University of Sussex, Brighton, 1977. [all data]
Stephenson and Malanowski, 1987
Stephenson, Richard M.; Malanowski, Stanislaw,
Handbook of the Thermodynamics of Organic Compounds, 1987, https://doi.org/10.1007/978-94-009-3173-2
. [all data]
Stull, 1947
Stull, Daniel R.,
Vapor Pressure of Pure Substances. Organic and Inorganic Compounds,
Ind. Eng. Chem., 1947, 39, 4, 517-540, https://doi.org/10.1021/ie50448a022
. [all data]
Tret'yakov, 2007
Tret'yakov, K.V.,
Retention Data. NIST Mass Spectrometry Data Center., NIST Mass Spectrometry Data Center, 2007. [all data]