Naphthalene, 2-ethyl-

Van Den Dool and Kratz RI, non-polar column, custom temperature program

Data compiled by: NIST Mass Spectrometry Data Center, William E. Wallace, director

Column type Capillary
Active phase HP-5
Column length (m) 30.
Carrier gas He
Substrate
Column diameter (mm) 0.25
Phase thickness (μm) 0.25
Program 40C(3min) => 4C/min => 208C => 25C/min => 290C(5min)
I 1390.
ReferenceSandercock and du Pasquier, 2003
Comment MSDC-RI

Lee's RI, non-polar column, custom temperature program

Data compiled by: NIST Mass Spectrometry Data Center, William E. Wallace, director

Column type CapillaryCapillaryCapillaryCapillaryCapillary
Active phase DB-5DB-5MSHP-5MSLM-5Ultra-1
Column length (m) 60.60.30.30.50.
Carrier gas   HeHeNitrogen
Substrate
Column diameter (mm)  0.250.300.250.32
Phase thickness (μm)   0.250.250.50
Program not specifiednot specified50 0C (2 min) 8 0C/min -> 120 0C (3 min) 10 0C/min -> 230 0C60C(2min) => 15C/min => 180C => 5C/min => 280C (10min)40-100 0C 3-15 0C/min -> 290 0C
I 239.4238.5233.44236.3236.1
ReferenceFuentes, Font, et al., 2007Aracil, Font, et al., 2005Cheng, Liu, et al., 2005Ré-Poppi and Santiago-Silva, 2005Sremac, Skrbic, et al., 2005
Comment MSDC-RI MSDC-RI MSDC-RI MSDC-RI MSDC-RI
Column type CapillaryCapillaryCapillaryCapillaryCapillary
Active phase HP-5SE-52SE-54DB-5CP Sil 8 CB
Column length (m) 30.30. 30.50.
Carrier gas He  HeHe
Substrate
Column diameter (mm) 0.250.30 0.250.25
Phase thickness (μm) 0.25  0.250.25
Program 40C(3min) => 4C/min => 208C => 25C/min => 290C(5min)not specifiednot specified60 0C (3 min) 10 0C/min -> 100 0C (3 min) 5 0C/min -> 300 0Cnot specified
I 239.32234.56237.74238.9238.5
ReferenceSandercock and du Pasquier, 2003Wang, Peng, et al., 1997Guillen, Iglesias, et al., 1992Paschke, Herbel, et al., 1992Bundt, Herbel, et al., 1991
Comment MSDC-RI MSDC-RI MSDC-RI MSDC-RI MSDC-RI
Column type Capillary
Active phase CP Sil 8 CB
Column length (m) 50.
Carrier gas He
Substrate
Column diameter (mm) 0.25
Phase thickness (μm) 0.25
Program not specified
I 239.0
ReferenceBundt, Herbel, et al., 1991
Comment MSDC-RI

Van Den Dool and Kratz RI, polar column, temperature ramp

Data compiled by: NIST Mass Spectrometry Data Center, William E. Wallace, director

Column type CapillaryCapillaryCapillaryCapillaryCapillary
Active phase Supelcowax-10Supelcowax-10Supelcowax-10Supelcowax-10Supelcowax-10
Column length (m) 60.60.60.60.60.
Carrier gas HeHeHe
Substrate
Column diameter (mm) 0.250.250.250.250.25
Phase thickness (μm) 0.250.250.250.250.25
Tstart (C) 35.35.35.40.40.
Tend (C) 195.195.195.175.175.
Heat rate (K/min) 2.2.2.2.2.
Initial hold (min) 5.5.5.5.5.
Final hold (min) 90.90.90.20.20.
I 1953.1953.1965.1960.1961.
ReferenceChung, Yung, et al., 2002Chung, Yung, et al., 2001Chung, 1999Tanchotikul and Hsieh, 1989Tanchotikul and Hsieh, 1989
Comment MSDC-RI MSDC-RI MSDC-RI MSDC-RI MSDC-RI

References

Sandercock and du Pasquier, 2003
Sandercock, P.M.L.; du Pasquier, E., Chemical fingerprinting of unevaporated automotive gasoline samples, Forensic Sci. Int., 2003, 134, 1, 1-10, https://doi.org/10.1016/S0379-0738(03)00081-1 . [all data]