N-(2-Hydroxyethyl)-N-methylaniline
- Formula: C9H13NO
- Molecular weight: 151.2056
- IUPAC Standard InChIKey: VIIZJXNVVJKISZ-UHFFFAOYSA-N
- CAS Registry Number: 93-90-3
- Chemical structure:
View 3d structure (requires JavaScript / HTML 5) - Other names: N-Hydroxyethyl-N-methylaniline; N-Methyl-N-phenylethanolamine; 2-(N-Methylanilino)ethanol; Ethanol, 2-(methylphenylamino)-; Ethanol, 2-(N-methylanilino)-; N-Methyl-N-β-hydroxyethylaniline; N-Methyl-N-(hydroxyethyl)aniline; N-Methyl-N-(2-hydroxyethyl)aniline; Phenylmethylethanolamine; 2-(Methylphenylamino)ethanol; 2-(N-Methyl-N-phenylamino)ethanol; 2-(N-Methylaniline)ethanol; 2-(N-Fenyl-N-methylamino)ethanol; NSC 9274

Phase change data

Data compiled by: Robert L. Brown and Stephen E. Stein
Reduced pressure boiling point
Tboil (K) | Pressure (bar) | Reference |
---|---|---|
422. to 424. | 0.019 | Frinton Laboratories Inc., 1986 |

References

Frinton Laboratories Inc., 1986
Frinton Laboratories Inc.,
Catalog Number 11, Frinton Laboratories Inc., Vineland, NJ, 1986, 99. [all data]