Phenylpropylmethylamine
- Formula: C10H15N
- Molecular weight: 149.2328
- IUPAC Standard InChIKey: CWSGTPMVOJFVIF-UHFFFAOYSA-N
- CAS Registry Number: 93-88-9
- Chemical structure:
View 3d structure (requires JavaScript / HTML 5) - Other names: Phenpromethamine

Normal alkane RI, non-polar column, custom temperature program

Column type | Active phase | I | Reference | Comment |
---|---|---|---|---|
Other | Methyl Silicone | 1176. | Ardrey and Moffat, 1981 | Program: not specified |

Phase change data

Data compiled by: Robert L. Brown and Stephen E. Stein
Quantity | Value | Units | Method | Reference | Comment |
---|---|---|---|---|---|
Tboil | 480.7 | K | N/A | Weast and Grasselli, 1989 |
Reduced pressure boiling point
Tboil (K) | Pressure (atm) | Reference |
---|---|---|
368.7 | 0.020 | Weast and Grasselli, 1989 |

References

Ardrey and Moffat, 1981
Ardrey, R.E.; Moffat, A.C.,
Gas-liquid chromatographic retention indices of 1318 substances of toxicological interest on SE-30 or OV-1 stationary phase,
J. Chromatogr., 1981, 220, 3, 195-252, https://doi.org/10.1016/S0021-9673(00)81925-1
. [all data]