Acetic acid, (2,4,5-trichlorophenoxy)-
- Formula: C8H5Cl3O3
- Molecular weight: 255.483
- IUPAC Standard InChIKey: SMYMJHWAQXWPDB-UHFFFAOYSA-N
- CAS Registry Number: 93-76-5
- Chemical structure:
View 3d structure (requires JavaScript / HTML 5) - Other names: (2,4,5-Trichlorophenoxy)acetic acid; BCF-Bushkiller; Forst U 46; Fortex; Trioxon; Verton 2-T; 2,4,5-T; (2,4,5-Trichloor-fenoxy)-azijnzuur; (2,4,5-Trichlor-phenoxy)-essigsaeure; Acide 2,4,5-trichloro phenoxyacetique; Acido (2,4,5-tricloro-fenossi)-acetico; Brush rhap; Brush-off 445 low volatile brush killer; Decamine 4T; Ded-weed brush killer; Ded-weed lv-6 brush kil and t-5 brush kil; Envert-T; Estercide t-2 and t-245; Fence rider; Forron; Fruitone A; Inverton 245; Line rider; Phortox; Reddon; Reddox; Spontox; Tippontormona; Veon 245; VEON; Brushtox; Debroussaillant concentre; Debroussaillant super concentre; Farmco fence rider; Kwas 2,4,5-trojchlorofenoksyoctowy; NA 2765; Rcra waste number U232; Super D weedone; Tippon; Visko rhap low volatile ester; Arbokan

Phase change data

Data compiled as indicated in comments:
TRC - Thermodynamics Research Center, NIST Boulder Laboratories, Chris Muzny director
AC - William E. Acree, Jr., James S. Chickos
Quantity | Value | Units | Method | Reference | Comment |
---|---|---|---|---|---|
Tfus | 429.51 | K | N/A | Donnelly, Drewes, et al., 1990 | Uncertainty assigned by TRC = 0.2 K; TRC |
Tfus | 428.0 | K | N/A | Plato and Glasgow, 1969 | Uncertainty assigned by TRC = 0.2 K; TRC |
Tfus | 428.4 | K | N/A | Plato and Glasgow, 1969 | Uncertainty assigned by TRC = 0.2 K; TRC |
Tfus | 426. | K | N/A | Galat, 1952 | Uncertainty assigned by TRC = 2. K; TRC |
Enthalpy of fusion
ΔfusH (kJ/mol) | Temperature (K) | Method | Reference | Comment |
---|---|---|---|---|
38.0 | 428.7 | DSC | Acree, 1991 | See also Donnelly, Drewes, et al., 1990, 2.; AC |

References

Donnelly, Drewes, et al., 1990
Donnelly, J.R.; Drewes, L.A.; Johnson, R.L.; Munslow, W.D.; Knapp, K.K.; Sovocool, G.W.,
Purity and heat of fusion data for environmental standards as determined by differential scanning calorimetry,
Thermochim. Acta, 1990, 167, 2, 155, https://doi.org/10.1016/0040-6031(90)80476-F
. [all data]
Plato and Glasgow, 1969
Plato, C.; Glasgow, A.R., Jr.,
Differential scanning calorimetry as a general method for determining the purity and heat of fusion of high-purity organic chemicals. Application to 95 compounds,
Anal. Chem., 1969, 41, 2, 330, https://doi.org/10.1021/ac60271a041
. [all data]
Galat, 1952
Galat, A.,
The Preparation of 2,3,5-Trichlorophenoxyacetic acid (2,4,5-T),
J. Am. Chem. Soc., 1952, 74, 3890-1. [all data]
Acree, 1991
Acree, William E.,
Thermodynamic properties of organic compounds: enthalpy of fusion and melting point temperature compilation,
Thermochimica Acta, 1991, 189, 1, 37-56, https://doi.org/10.1016/0040-6031(91)87098-H
. [all data]
Donnelly, Drewes, et al., 1990, 2
Donnelly, J.R.; Drewes, L.A.; Johnson, R.L.; Munslow, W.D.; Knapp, K.K.; Sovocool, G.W.,
Purity and heat of fusion data for environmental standards as determined by differential scanning calorimetry,
Thermochimica Acta, 1990, 167, 2, 155-187, https://doi.org/10.1016/0040-6031(90)80476-F
. [all data]
Lang (editor), 1972
Lang (editor), L.,
Absorption Spectra in the Ultraviolet and Visible Region, 1972, 17, 77. [all data]