3,3',4,4'-Tetrabromodiphenyl ether
- Formula: C12H6Br4O
- Molecular weight: 485.791
- IUPAC Standard InChIKey: RYGLOWMCGZHYRQ-UHFFFAOYSA-N
- CAS Registry Number: 93703-48-1
- Chemical structure:
View 3d structure (requires JavaScript / HTML 5) - Other names: PBDE Congener No. 77

Phase change data

Data compiled by: William E. Acree, Jr., James S. Chickos
Enthalpy of vaporization
ΔvapH (kcal/mol) | Temperature (K) | Method | Reference | Comment |
---|---|---|---|---|
22.8 | 418. | GC | Wong, Lei, et al., 2001 | Based on data from 363. to 473. K. |

References

Wong, Lei, et al., 2001
Wong, Alexander; Lei, Ying Duan; Alaee, Mehran; Wania, Frank,
Vapor Pressures of the Polybrominated Diphenyl Ethers,
J. Chem. Eng. Data, 2001, 46, 2, 239-242, https://doi.org/10.1021/je0002181
. [all data]