Cinnamamide, α-cyano-m-nitrothio- (7CI)
- Formula: C10H17N3O2S
- Molecular weight: 243.326
- IUPAC Standard InChIKey: IMZBDOVXGBZCOL-XBXARRHUSA-N
- CAS Registry Number: 93690-11-0
- Chemical structure:
View 3d structure (requires JavaScript / HTML 5) - Permanent link for this species. Use this link for bookmarking this species for future reference.

Reaction thermochemistry data

Data compiled by: Hussein Y. Afeefy, Joel F. Liebman, and Stephen E. Stein
Individual Reactions
C20H14N6O4S2 = 2
By formula: C20H14N6O4S2 = 2C10H17N3O2S
Quantity | Value | Units | Method | Reference | Comment |
---|---|---|---|---|---|
ΔrH° | -73.4 | kJ/mol | Eqk | Brunskill, De, et al., 1980 | liquid phase; solvent: DMSO |

References

Brunskill, De, et al., 1980
Brunskill, J.S.A.; De, A.; Ewing, D.F.,
Substituent effects on reversible cycloaddition reaction,
J. Chem. Soc. Perkin Trans. 2, 1980, 4-7. [all data]