2,4-diethylphenol
- Formula: C10H14O
- Molecular weight: 150.2176
- IUPAC Standard InChIKey: LMLAXOBGXCTWBJ-UHFFFAOYSA-N
- CAS Registry Number: 936-89-0
- Chemical structure:
View 3d structure (requires JavaScript / HTML 5) - Other names: phenol, 2,4-diethyl-

Phase change data

Data compiled by: Thermodynamics Research Center, NIST Boulder Laboratories, Chris Muzny director
Quantity | Value | Units | Method | Reference | Comment |
---|---|---|---|---|---|
Tboil | 502.15 | K | N/A | Karr, 1957 | Uncertainty assigned by TRC = 3. K |
Tboil | 498.15 | K | N/A | Jager and Kattwinkel, 1955 | Uncertainty assigned by TRC = 3. K |
Tboil | 502.15 | K | N/A | Von Auwers and Mauss, 1928 | Uncertainty assigned by TRC = 4. K |

References

Karr, 1957
Karr, C.,
, U. S. Bur. Mines, Inform. Circ. IC 7802, 1957. [all data]
Jager and Kattwinkel, 1955
Jager, A.; Kattwinkel, R.,
Erdoel Kohle, 1955, 8, 706. [all data]
Von Auwers and Mauss, 1928
Von Auwers, K.; Mauss, W.,
Justus Liebigs Ann. Chem., 1928, 460, 240. [all data]