Allyl o-tolyl ether
- Formula: C10H12O
- Molecular weight: 148.2017
- IUPAC Standard InChIKey: LQOGVESOGIHDSO-UHFFFAOYSA-N
- CAS Registry Number: 936-72-1
- Chemical structure:

Phase change data

Data compiled by: Robert L. Brown and Stephen E. Stein
Reduced pressure boiling point
Tboil (K) | Pressure (bar) | Reference |
---|---|---|
375. to 377. | 0.035 | Frinton Laboratories Inc., 1986 |

References

Frinton Laboratories Inc., 1986
Frinton Laboratories Inc.,
Catalog Number 11, Frinton Laboratories Inc., Vineland, NJ, 1986, 99. [all data]