1,3-Dioxolane, 2-phenyl-
- Formula: C9H10O2
- Molecular weight: 150.1745
- IUPAC Standard InChIKey: LYINTWKRUWVLBA-UHFFFAOYSA-N
- CAS Registry Number: 936-51-6
- Chemical structure:
View 3d structure (requires JavaScript / HTML 5) - Other names: Benzaldehyde ethylene acetal; 2-Phenyl-1,3-dioxolane

Gas phase thermochemistry data

Data compiled by: Hussein Y. Afeefy, Joel F. Liebman, and Stephen E. Stein
Quantity | Value | Units | Method | Reference | Comment |
---|---|---|---|---|---|
ΔfH°gas | -205.3 ± 1.3 | kJ/mol | Ccr | Verevkin, Dogan, et al., 1995 | See Beckhaus, Dogan, et al., 1990 |

Condensed phase thermochemistry data

Data compiled by: Hussein Y. Afeefy, Joel F. Liebman, and Stephen E. Stein
Quantity | Value | Units | Method | Reference | Comment |
---|---|---|---|---|---|
ΔfH°liquid | -267.4 ± 1.3 | kJ/mol | Ccr | Verevkin, Dogan, et al., 1995 | See Beckhaus, Dogan, et al., 1990 |
Quantity | Value | Units | Method | Reference | Comment |
ΔcH°liquid | -4703.3 | kJ/mol | Ccr | Verevkin, Dogan, et al., 1995 | See Beckhaus, Dogan, et al., 1990; Corresponding ΔfHºliquid = -267.4 kJ/mol (simple calculation by NIST; no Washburn corrections) |

Phase change data

Data compiled as indicated in comments:
BS - Robert L. Brown and Stephen E. Stein
AC - William E. Acree, Jr., James S. Chickos
ALS - Hussein Y. Afeefy, Joel F. Liebman, and Stephen E. Stein
DRB - Donald R. Burgess, Jr.
Quantity | Value | Units | Method | Reference | Comment |
---|---|---|---|---|---|
Tboil | 413.2 | K | N/A | Aldrich Chemical Company Inc., 1990 | BS |
Quantity | Value | Units | Method | Reference | Comment |
ΔvapH° | 62.6 ± 0.7 | kJ/mol | GS | Verevkin, 2002 | Based on data from 285. to 333. K.; AC |
ΔvapH° | 62.13 ± 0.25 | kJ/mol | V | Verevkin, Dogan, et al., 1995 | See Beckhaus, Dogan, et al., 1990; ALS |
ΔvapH° | 62.1 | kJ/mol | N/A | Verevkin, Dogan, et al., 1995 | DRB |
Enthalpy of vaporization
ΔvapH (kJ/mol) | Temperature (K) | Method | Reference | Comment |
---|---|---|---|---|
62.1 ± 0.3 | 316. | GS | Verevkin, Dogan, et al., 1995 | Based on data from 298. to 333. K.; AC |

References

Verevkin, Dogan, et al., 1995
Verevkin, S.P.; Dogan, B.; Hdrich, J.; Beckhaus, H.-D.; Rchardt, C.,
Geminal substituent effects. VIII. Enthalpies of formation of acetals,
J. Prakt. Chem., 1995, 337, 93-98. [all data]
Beckhaus, Dogan, et al., 1990
Beckhaus, H.D.; Dogan, B.; Verevkin, S.; Hadrich, J.; Ruchardt, C.,
Dependence of anomeric stabilization on structure in acetals,
Angew. Chem. Int. Ed. Engl., 1990, 29, 320-321. [all data]
Aldrich Chemical Company Inc., 1990
Aldrich Chemical Company Inc.,
Catalog Handbook of Fine Chemicals, Aldrich Chemical Company, Inc., Milwaukee WI, 1990, 1. [all data]
Verevkin, 2002
Verevkin, Sergey P.,
Improved Benson Increments for the Estimation of Standard Enthalpies of Formation and Enthalpies of Vaporization of Alkyl Ethers, Acetals, Ketals, and Ortho Esters,
J. Chem. Eng. Data, 2002, 47, 5, 1071-1097, https://doi.org/10.1021/je020023o
. [all data]