Phenol, 2,3,5,6-tetrachloro-
- Formula: C6H2Cl4O
- Molecular weight: 231.891
- IUPAC Standard InChIKey: KEWNKZNZRIAIAK-UHFFFAOYSA-N
- CAS Registry Number: 935-95-5
- Chemical structure:
View 3d structure (requires JavaScript / HTML 5) - Other names: 2,3,5,6-Tetrachlorophenol

Kovats' RI, non-polar column, isothermal

Column type | Active phase | Temperature (C) | I | Reference | Comment |
---|---|---|---|---|---|
Capillary | SE-30 | 160. | 1530. | Evans and Haken, 1989 | Column length: 25. m; Column diameter: 0.32 mm |
Capillary | SE-30 | 140. | 1511. | Korhonen, 1984 | |
Capillary | SE-30 | 160. | 1530. | Korhonen, 1984 | |
Capillary | SE-30 | 180. | 1551. | Korhonen, 1984 |

Kovats' RI, polar column, isothermal

Column type | Active phase | Temperature (C) | I | Reference | Comment |
---|---|---|---|---|---|
Capillary | FFAP | 160. | 2553. | Evans and Haken, 1989 | Column length: 25. m; Column diameter: 0.35 mm |
Capillary | FFAP | 160. | 2553. | Korhonen, 1984 | |
Capillary | FFAP | 180. | 2573. | Korhonen, 1984 | |
Capillary | FFAP | 200. | 2615. | Korhonen, 1984 |

Van Den Dool and Kratz RI, non-polar column, temperature ramp

Column type | Active phase | I | Reference | Comment |
---|---|---|---|---|
Capillary | SE-30 | 1545. | Korhonen, 1984 | 10. K/min; Tstart: 100. C |
Capillary | SE-30 | 1515. | Korhonen, 1984 | 2. K/min; Tstart: 100. C |
Capillary | SE-30 | 1536. | Korhonen, 1984 | 6. K/min; Tstart: 100. C |

Van Den Dool and Kratz RI, polar column, temperature ramp

Column type | Active phase | I | Reference | Comment |
---|---|---|---|---|
Capillary | FFAP | 2620. | Korhonen, 1984 | 10. K/min; Tstart: 100. C |
Capillary | FFAP | 2598. | Korhonen, 1984 | 2. K/min; Tstart: 100. C |
Capillary | FFAP | 2603. | Korhonen, 1984 | 6. K/min; Tstart: 100. C |

Normal alkane RI, non-polar column, custom temperature program

Column type | Active phase | I | Reference | Comment |
---|---|---|---|---|
Capillary | Methyl Silicone | 1511. | Yu and Zazhi, 2005 | Program: not specified |

References

Jondorf and Williams, 1958
Jondorf, W.R.; Williams, R.T.,
Biochem. J., 1958, 69, 181. [all data]
Evans and Haken, 1989
Evans, M.B.; Haken, J.K.,
Dispersion and selectivity indices in gas chromatography. IV. Chlorinated aromatic compounds,
J. Chromatogr., 1989, 468, 373-382, https://doi.org/10.1016/S0021-9673(00)96332-5
. [all data]
Korhonen, 1984
Korhonen, I.O.O.,
Gas-liquid chromatographic analyses. XXXI. Retention increments of isomeric chlorophenols on low-polarity (SE-30) and polar (FFAP) capillary columns,
J. Chromatogr., 1984, 315, 185-200, https://doi.org/10.1016/S0021-9673(01)90736-8
. [all data]
Yu and Zazhi, 2005
Yu, H.; Zazhi, J.,
Relationship between chromatogram retention index and toxicity of chlorinated phenols and chlorinated benzenes to Guppy,
J. Enviropn. Health (Chinese), 2005, 22, 6, 441-444. [all data]