perbenzoic acid
- Formula: C7H6O3
- Molecular weight: 138.1207
- IUPAC Standard InChIKey: XCRBXWCUXJNEFX-UHFFFAOYSA-N
- CAS Registry Number: 93-59-4
- Chemical structure:
View 3d structure (requires JavaScript / HTML 5) - Permanent link for this species. Use this link for bookmarking this species for future reference.

Condensed phase thermochemistry data

Data compiled by: Hussein Y. Afeefy, Joel F. Liebman, and Stephen E. Stein
Quantity | Value | Units | Method | Reference | Comment |
---|---|---|---|---|---|
ΔfH°solid | -367. ± 13. | kJ/mol | Cm | Briner and Chastonay, 1954 | Reanalyzed by Cox and Pilcher, 1970, Original value = -356. kJ/mol |

Reaction thermochemistry data

Data compiled by: Hussein Y. Afeefy, Joel F. Liebman, and Stephen E. Stein
Individual Reactions
By formula: C7H6O + C7H6O3 = 2C7H6O2
Quantity | Value | Units | Method | Reference | Comment |
---|---|---|---|---|---|
ΔrH° | -316. ± 13. | kJ/mol | Cm | Briner and Chastonay, 1954 | liquid phase; Reanalyzed by Cox and Pilcher, 1970, Original value = -317. ± 13. kJ/mol |
By formula: C7H6O3 = C7H6O + O2
Quantity | Value | Units | Method | Reference | Comment |
---|---|---|---|---|---|
ΔrH° | 253. | kJ/mol | Cm | Briner and Chastonay, 1954 | solid phase |

References

Briner and Chastonay, 1954
Briner, E.; Chastonay, P.,
Etude thermochemique de l'autoxydation de Valdehyde benzoique,
Helv. Chim. Acta, 1954, 238, 539-541. [all data]
Cox and Pilcher, 1970
Cox, J.D.; Pilcher, G.,
Thermochemistry of Organic and Organometallic Compounds, Academic Press, New York, 1970, 1-636. [all data]