cis-1,2,3,6-Tetrahydrophthalic anhydride
- Formula: C8H8O3
- Molecular weight: 152.1473
- IUPAC Standard InChIKey: KMOUUZVZFBCRAM-OLQVQODUSA-N
- CAS Registry Number: 935-79-5
- Chemical structure:
View 3d structure (requires JavaScript / HTML 5) - Stereoisomers:
- Other names: Tetrahydrophthalic anhydride; cis-4-Cyclohexene-1,2-dicarboxylic anhydride; 1,3-Isobenzofurandione, 3a,4,7,7a-tetrahydro-, cis-; cis-3a,4,7,7a-Tetrahydro-1,3-isobenzofurandione; 3a,4,7,7a-Tetrahydro-2-benzofuran-1,3-dione, (Z)-; 1,3-Isobenzofurandione, 3a,4,7,7a-tetrahydro-, (3aR,7aS)-rel-

Condensed phase thermochemistry data

Data compiled by: Hussein Y. Afeefy, Joel F. Liebman, and Stephen E. Stein
Quantity | Value | Units | Method | Reference | Comment |
---|---|---|---|---|---|
ΔfH°solid | -772. ± 2. | kJ/mol | Ccb | Nurullaev, Mekhtiev, et al., 1984 | |
Quantity | Value | Units | Method | Reference | Comment |
ΔcH°solid | -3519. ± 2. | kJ/mol | Ccb | Nurullaev, Mekhtiev, et al., 1984 | Corresponding ΔfHºsolid = -771.91 kJ/mol (simple calculation by NIST; no Washburn corrections) |

Phase change data

Data compiled as indicated in comments:
TRC - Thermodynamics Research Center, NIST Boulder Laboratories, Chris Muzny director
AC - William E. Acree, Jr., James S. Chickos
ALS - Hussein Y. Afeefy, Joel F. Liebman, and Stephen E. Stein
Quantity | Value | Units | Method | Reference | Comment |
---|---|---|---|---|---|
Ttriple | 371.6 | K | N/A | Weinstein, Leffler, et al., 1984 | Crystal phase 1 phase; Uncertainty assigned by TRC = 1.5 K; TRC |
Enthalpy of vaporization
ΔvapH (kJ/mol) | Temperature (K) | Reference | Comment |
---|---|---|---|
53.1 ± 0.1 | 325. to 525. | Nurullaev, Mekhtiev, et al., 1984, 2 | AC |
Enthalpy of sublimation
ΔsubH (kJ/mol) | Temperature (K) | Method | Reference | Comment |
---|---|---|---|---|
53.1 ± 0.2 | 325. | V | Nurullaev, Mekhtiev, et al., 1984 | ALS |

References

Nurullaev, Mekhtiev, et al., 1984
Nurullaev, G.G.; Mekhtiev, S.A.; Karasharli, K.A.; Musaeva, N.F.; Salakhov, M.S.,
Heats of combustion, formation, and evaporation of cyclic 1,2-dicarboxylic acids,
Azerb. Khim. Zh., 1984, 132-135. [all data]
Weinstein, Leffler, et al., 1984
Weinstein, D.I.; Leffler, A.J.; Currie, J.A.,
Phase Transitions in Bicyclic Compounds,
Mol. Cryst. Liq. Cryst., 1984, 104, 95. [all data]
Nurullaev, Mekhtiev, et al., 1984, 2
Nurullaev, G.G.; Mekhtiev, S.A.; Karasharli, K.A.; Musaeva, N.F.; Salakhov, M.S.,
Azerb. Khim. Zh., 1984, 132. [all data]