1,2-Ethanediol, 1-phenyl-
- Formula: C8H10O2
- Molecular weight: 138.1638
- IUPAC Standard InChIKey: PWMWNFMRSKOCEY-UHFFFAOYSA-N
- CAS Registry Number: 93-56-1
- Chemical structure:
View 3d structure (requires JavaScript / HTML 5) - Other names: Styrene glycol; α,β-Dihydroxyethylbenzene; Phenyl glycol; Phenylethanediol; Phenylethylene glycol; Styrolyl alcohol; 1-Phenyl-1,2-ethanediol; 1,2-Dihydroxy-1-phenylethane; Phenyl-1,2-ethanediol; 1,2-Dihydroxyethylbenzene; 1,2-Ethanediol, phenyl-; 1-Fenyl-1,2-ethandiol; Fenylglycol; 1-Phenylethylene glycol; NSC 406601; 1-Phenylethane-1,2-diol; 7138-28-5; 170678-55-4; phenylethane-1,2-diol

Phase change data

Data compiled as indicated in comments:
BS - Robert L. Brown and Stephen E. Stein
TRC - Thermodynamics Research Center, NIST Boulder Laboratories, Chris Muzny director
Quantity | Value | Units | Method | Reference | Comment |
---|---|---|---|---|---|
Tboil | 546.2 | K | N/A | Aldrich Chemical Company Inc., 1990 | BS |
Quantity | Value | Units | Method | Reference | Comment |
Tfus | 340.15 | K | N/A | Baumgarten, Bower, et al., 1957 | Uncertainty assigned by TRC = 2. K; TRC |
Tfus | 341.2 | K | N/A | Adkins and Billica, 1948 | Uncertainty assigned by TRC = 2. K; TRC |
Tfus | 338.65 | K | N/A | Milas and Sussman, 1937 | Uncertainty assigned by TRC = 1. K; TRC |
Tfus | 336. | K | N/A | Palfray, Sabetay, et al., 1931 | Uncertainty assigned by TRC = 4. K; TRC |

Van Den Dool and Kratz RI, non-polar column, temperature ramp

Column type | Active phase | I | Reference | Comment |
---|---|---|---|---|
Capillary | DB-1 | 1372. | Adedeji, Hartman, et al., 1991 | 60. m/0.25 mm/0.25 μm, He, 40. C @ 3. min, 2. K/min, 280. C @ 10. min |

Van Den Dool and Kratz RI, non-polar column, custom temperature program

Column type | Active phase | I | Reference | Comment |
---|---|---|---|---|
Capillary | HP-5MS | 1308.1 | Andriamaharavo, 2014 | 30. m/0.25 mm/0.25 μm, He; Program: 60C (1 min) => 5 C/min => 210C => 10 C/min => 280C (15 min) |

Normal alkane RI, non-polar column, temperature ramp

Column type | Active phase | I | Reference | Comment |
---|---|---|---|---|
Capillary | DB-1 | 1384. | Peppard, 1992 | 30. m/0.25 mm/1.0 μm, He, 3. K/min, 250. C @ 30. min; Tstart: 40. C |

Normal alkane RI, polar column, custom temperature program

Column type | Active phase | I | Reference | Comment |
---|---|---|---|---|
Capillary | HP-Innowax | 1735. | Quijano and Pino, 2006 | 60. m/0.25 mm/0.25 μm, Nitrogen; Program: 50 0C (4 min) -> 40 0C 4 0C/min -> 220 0C |

References

Aldrich Chemical Company Inc., 1990
Aldrich Chemical Company Inc.,
Catalog Handbook of Fine Chemicals, Aldrich Chemical Company, Inc., Milwaukee WI, 1990, 1. [all data]
Baumgarten, Bower, et al., 1957
Baumgarten, H.E.; Bower, F.A.; Okamoto, T.T.,
Reaction of Amines II. Degradation via Tertiary Amine Oxides,
J. Am. Chem. Soc., 1957, 79, 3145. [all data]
Adkins and Billica, 1948
Adkins, H.; Billica, H.R.,
The Hydrogenation of Esters to Alcohols at 15 - 150 deg,
J. Am. Chem. Soc., 1948, 70, 3121-5. [all data]
Milas and Sussman, 1937
Milas, N.A.; Sussman, S.,
The Hydroxylation of Unsaturated Substances. IV. The Catalytic Hydroxylation of Unsaturated Hydrocarbons,
J. Am. Chem. Soc., 1937, 59, 2345. [all data]
Palfray, Sabetay, et al., 1931
Palfray, L.; Sabetay, S.; Sontag, D.,
Dehydration of Phenlethanediol (phynylglycol) By Means of Posassium Hydroxide,
C. R. Hebd. Seances Acad. Sci., 1931, 193, 941-4. [all data]
Adedeji, Hartman, et al., 1991
Adedeji, J.; Hartman, T.G.; Rosen, R.T.; Ho, C.-T.,
Free and glycosidically bound aroma compounds in hog plum (Spondias mombins L.),
J. Agric. Food Chem., 1991, 39, 8, 1494-1497, https://doi.org/10.1021/jf00008a025
. [all data]
Andriamaharavo, 2014
Andriamaharavo, N.R.,
Retention Data. NIST Mass Spectrometry Data Center., NIST Mass Spectrometry Data Center, 2014. [all data]
Peppard, 1992
Peppard, T.L.,
Volatile flavor constituents of Monstera deliciosa,
J. Agric. Food Chem., 1992, 40, 2, 257-262, https://doi.org/10.1021/jf00014a018
. [all data]
Quijano and Pino, 2006
Quijano, C.E.; Pino, J.A.,
Changes in volatile constituents during the ripening of cocona (Solanum sessiliflorum Dunal) fruit,
Revista CENIC Ciencias Quimicas, 2006, 37, 3, 133-136. [all data]