Benzene, (1,2-dibromoethyl)-
- Formula: C8H8Br2
- Molecular weight: 263.957
- IUPAC Standard InChIKey: SHKKTLSDGJRCTR-UHFFFAOYSA-N
- CAS Registry Number: 93-52-7
- Chemical structure:
View 3d structure (requires JavaScript / HTML 5) - Other names: α,β-Dibromoethylbenzene; (1,2-Dibromoethyl)benzene; Dowspray 9; 1,2-Dibromo-1-phenylethane; 1,2-Dibromo-2-phenylethane; Styrene dibromide; 1-Phenyl-1,2-dibromoethane; 1,2-Dibromophenylethane

Phase change data

Data compiled as indicated in comments:
BS - Robert L. Brown and Stephen E. Stein
TRC - Thermodynamics Research Center, NIST Boulder Laboratories, Chris Muzny director
AC - William E. Acree, Jr., James S. Chickos
Quantity | Value | Units | Method | Reference | Comment |
---|---|---|---|---|---|
Tfus | 346.15 | K | N/A | Vaiser, Riabov, et al., 1957 | Uncertainty assigned by TRC = 3. K; TRC |
Tfus | 346.65 | K | N/A | Snyder and Brewster, 1949 | Uncertainty assigned by TRC = 1.5 K; TRC |
Reduced pressure boiling point
Tboil (K) | Pressure (bar) | Reference | Comment |
---|---|---|---|
413.2 | 0.020 | Aldrich Chemical Company Inc., 1990 | BS |
Enthalpy of vaporization
ΔvapH (kJ/mol) | Temperature (K) | Method | Reference | Comment |
---|---|---|---|---|
50.8 | 427. | N/A | Dykyj, Svoboda, et al., 1999 | Based on data from 412. to 504. K.; AC |
64.9 | 374. | A | Stephenson and Malanowski, 1987 | Based on data from 359. to 527. K. See also Stull, 1947 and Dykyj and Vanko, 1970.; AC |
Antoine Equation Parameters
log10(P) = A − (B / (T + C))
P = vapor pressure (bar)
T = temperature (K)
View plot Requires a JavaScript / HTML 5 canvas capable browser.
Temperature (K) | A | B | C | Reference | Comment |
---|---|---|---|---|---|
359. to 527. | 5.53975 | 2709.56 | -37.341 | Stull, 1947 | Coefficents calculated by NIST from author's data. |

References

Vaiser, Riabov, et al., 1957
Vaiser, V.L.; Riabov, V.; Kryvelev, B.I.,
Catalytic Cracking of Ethylidenediisopropylbenzene,
Dokl. Akad. Nauk SSSR, Ser. Khim., 1957, 112, 655. [all data]
Snyder and Brewster, 1949
Snyder, H.R.; Brewster, J.H.,
The Sterochemical Course of Amine Replacement Reactions. Some Reactions of d-(+)-N,N,N-trimethyl-α-phenylethylammonium Iodide,
J. Am. Chem. Soc., 1949, 71, 291. [all data]
Aldrich Chemical Company Inc., 1990
Aldrich Chemical Company Inc.,
Catalog Handbook of Fine Chemicals, Aldrich Chemical Company, Inc., Milwaukee WI, 1990, 1. [all data]
Dykyj, Svoboda, et al., 1999
Dykyj, J.; Svoboda, J.; Wilhoit, R.C.; Frenkel, M.L.; Hall, K.R.,
Vapor Pressure of Chemicals: Part A. Vapor Pressure and Antoine Constants for Hydrocarbons and Sulfur, Selenium, Tellurium and Hydrogen Containing Organic Compounds, Springer, Berlin, 1999, 373. [all data]
Stephenson and Malanowski, 1987
Stephenson, Richard M.; Malanowski, Stanislaw,
Handbook of the Thermodynamics of Organic Compounds, 1987, https://doi.org/10.1007/978-94-009-3173-2
. [all data]
Stull, 1947
Stull, Daniel R.,
Vapor Pressure of Pure Substances. Organic and Inorganic Compounds,
Ind. Eng. Chem., 1947, 39, 4, 517-540, https://doi.org/10.1021/ie50448a022
. [all data]
Dykyj and Vanko, 1970
Dykyj, J.; Vanko, A.,
Petrochemica, 1970, 10, 1, 3. [all data]