Acetaldehyde, phenylhydrazone
- Formula: C8H10N2
- Molecular weight: 134.1784
- IUPAC Standard InChIKey: KURBTRNHGDQKOS-UHFFFAOYSA-N
- CAS Registry Number: 935-07-9
- Chemical structure:
View 3d structure (requires JavaScript / HTML 5) - Permanent link for this species. Use this link for bookmarking this species for future reference.

Condensed phase thermochemistry data

Data compiled by: Hussein Y. Afeefy, Joel F. Liebman, and Stephen E. Stein
Quantity | Value | Units | Method | Reference | Comment |
---|---|---|---|---|---|
ΔfH°solid | -141. | kJ/mol | Ccb | Landrieu, 1905 | Author's hf298_condensed[kcal/mol]=-39.1 kcal/mol |
ΔfH°solid | -167. | kJ/mol | Cm | Landrieu, 1905 | |
Quantity | Value | Units | Method | Reference | Comment |
ΔcH°solid | -4436.3 | kJ/mol | Ccb | Landrieu, 1905 | Author's hf298_condensed[kcal/mol]=-39.1 kcal/mol |

Reaction thermochemistry data

Data compiled by: Hussein Y. Afeefy, Joel F. Liebman, and Stephen E. Stein
Individual Reactions
By formula: H2O + C8H10N2 = C6H8N2 + C2H4O
Quantity | Value | Units | Method | Reference | Comment |
---|---|---|---|---|---|
ΔrH° | -61.1 | kJ/mol | Cm | Landrieu, 1905 | solid phase |

References

Landrieu, 1905
Landrieu, M.Ph.,
Thermochimie. - Thermochimie des hydrazones,
Compt. Rend., 1905, 141, 358-361. [all data]