Ethanethioic acid, S-phenyl ester
- Formula: C8H8OS
- Molecular weight: 152.214
- IUPAC Standard InChIKey: WBISVCLTLBMTDS-UHFFFAOYSA-N
- CAS Registry Number: 934-87-2
- Chemical structure:

Phase change data

Data compiled by: Robert L. Brown and Stephen E. Stein
Reduced pressure boiling point
Tboil (K) | Pressure (atm) | Reference |
---|---|---|
372.7 | 0.008 | Aldrich Chemical Company Inc., 1990 |

Reaction thermochemistry data

Data compiled by: Hussein Y. Afeefy, Joel F. Liebman, and Stephen E. Stein
Individual Reactions
By formula: H2O + C8H8OS = C6H6S + C2H4O2
Quantity | Value | Units | Method | Reference | Comment |
---|---|---|---|---|---|
ΔrH° | -2.97 ± 0.08 | kcal/mol | Cm | Wadso, 1960 | liquid phase; Heat of hydrolysis |

References

Aldrich Chemical Company Inc., 1990
Aldrich Chemical Company Inc.,
Catalog Handbook of Fine Chemicals, Aldrich Chemical Company, Inc., Milwaukee WI, 1990, 1. [all data]
Wadso, 1960
Wadso, I.,
Heats of hydrolysis of phenyl acetate and phenyl thiolacetate,
Acta Chem. Scand., 1960, 14, 561-565. [all data]