N-(4-Hydroxyphenyl)-2-naphthylamine
- Formula: C16H13NO
- Molecular weight: 235.2805
- IUPAC Standard InChIKey: RACMGQBQYYWANW-UHFFFAOYSA-N
- CAS Registry Number: 93-45-8
- Chemical structure:
View 3d structure (requires JavaScript / HTML 5) - Other names: Phenol, 4-(2-naphthalenylamino)-; p-(β-Naphthylamino)phenol; p-(2-Naphthylamino)phenol; p-Hydroxyneozon; p-Hydroxyneozone; p-Hydroxyphenyl-β-naphthylamine; p-Hydroxyphenyl-2-naphthylamine; p-Oxinozon; p-Oxyneozone; N-(p-Hydroxyphenyl)-β-naphthylamine; N-(p-Hydroxyphenyl)-2-naphthylamine; Phenol, p-(2-naphthylamino)-; 4-Hydroxyphenyl-β-naphthylamine; 4-(2-Naftylamino)fenol; 4-(2-Naphthylamino)phenol; Phenol, 4-(2-naphthylamino)-; NSC 15372

Phase change data

Data compiled by: William E. Acree, Jr., James S. Chickos
Enthalpy of sublimation
ΔsubH (kJ/mol) | Temperature (K) | Method | Reference | Comment |
---|---|---|---|---|
126.8 | 390. | GS | Fel'dshtein and Kuz'minskii, 1971 | Based on data from 373. to 408. K. |

References

Fel'dshtein and Kuz'minskii, 1971
Fel'dshtein, L.S.; Kuz'minskii, A.S.,
Kauch. Rezina, 1971, 30, 11, 15. [all data]