1H-Benzimidazol-2-amine
- Formula: C7H7N3
- Molecular weight: 133.1506
- IUPAC Standard InChIKey: JWYUFVNJZUSCSM-UHFFFAOYSA-N
- CAS Registry Number: 934-32-7
- Chemical structure:
View 3d structure (requires JavaScript / HTML 5) - Other names: Benzimidazole, 2-amino-; 2-Aminobenzimidazole; 2-Iminobenzimidazoline; USAF ek-4037; 2-Benzimidazolamine; 2-Amino-1H-benzimidazole; benzimidazol-2-ylamine

Phase change data

Data compiled by: Thermodynamics Research Center, NIST Boulder Laboratories, Chris Muzny director
Quantity | Value | Units | Method | Reference | Comment |
---|---|---|---|---|---|
Tfus | 505.1 | K | N/A | Plato, 1972 | Uncertainty assigned by TRC = 0.2 K |

References

Plato, 1972
Plato, C.,
DSC as a general method for determining purity and heat of fusion of high-purity organic chemicals,
Anal. Chem., 1972, 44, 1531. [all data]