Bicyclo(2.2.1)heptane-2-carboxylic acid, endo-
- Formula: C8H12O2
- Molecular weight: 140.1797
- IUPAC Standard InChIKey: JESWDXIHOJGWBP-AHXFUIDQSA-N
- CAS Registry Number: 934-28-1
- Chemical structure:
View 3d structure (requires JavaScript / HTML 5) - Stereoisomers:

Phase change data

Data compiled by: Robert L. Brown and Stephen E. Stein
Quantity | Value | Units | Method | Reference | Comment |
---|---|---|---|---|---|
Tfus | 331. to 333. | K | N/A | Buckingham and Donaghy, 1982 |
Reduced pressure boiling point
Tboil (K) | Pressure (bar) | Reference |
---|---|---|
381. to 382. | 0.003 | Buckingham and Donaghy, 1982 |

References

Buckingham and Donaghy, 1982
Buckingham, J.; Donaghy, S.M.,
Dictionary of Organic Compounds: Fifth Edition, Chapman and Hall, New York, 1982, 1. [all data]