Benzoyl chloride, 2-methyl-
- Formula: C8H7ClO
- Molecular weight: 154.594
- IUPAC Standard InChIKey: GPZXFICWCMCQPF-UHFFFAOYSA-N
- CAS Registry Number: 933-88-0
- Chemical structure:
View 3d structure (requires JavaScript / HTML 5) - Species with the same structure:
- Other names: o-Toluoyl chloride; o-Methylbenzoyl chloride; o-Toluic acid chloride; 2-Methylbenzoyl chloride; 2-Toluoyl chloride; o-Toluyl chloride

Phase change data

Data compiled by: Robert L. Brown and Stephen E. Stein
Reduced pressure boiling point
Tboil (K) | Pressure (bar) | Reference |
---|---|---|
362.2 | 0.016 | Aldrich Chemical Company Inc., 1990 |
365. to 368. | 0.020 | Frinton Laboratories Inc., 1986 |

References

Aldrich Chemical Company Inc., 1990
Aldrich Chemical Company Inc.,
Catalog Handbook of Fine Chemicals, Aldrich Chemical Company, Inc., Milwaukee WI, 1990, 1. [all data]
Frinton Laboratories Inc., 1986
Frinton Laboratories Inc.,
Catalog Number 11, Frinton Laboratories Inc., Vineland, NJ, 1986, 99. [all data]