4,7-Methano-1H-indene, 3a,4,7,7a-tetrahydro-, (3aα,4β,7β,7aα)-
- Formula: C10H12
- Molecular weight: 132.2023
- CAS Registry Number: 933-60-8

Phase change data

Data compiled by: William E. Acree, Jr., James S. Chickos
Enthalpy of fusion
ΔfusH (kJ/mol) | Temperature (K) | Reference |
---|---|---|
7.11 | 189.8 | Smirnova, Lebedev, et al., 1997 |

Reaction thermochemistry data

Data compiled by: Hussein Y. Afeefy, Joel F. Liebman, and Stephen E. Stein
Individual Reactions
By formula: 2C5H6 = C10H12
Quantity | Value | Units | Method | Reference | Comment |
---|---|---|---|---|---|
ΔrH° | -195.7 | kJ/mol | Eqk | Lenz and Vaughan, 1989 | gas phase |

References

Smirnova, Lebedev, et al., 1997
Smirnova, N.N.; Lebedev, B.V.; Kiparisova, E.G.; Makovetskii, K.L.; Ostrovskaya, I.Ya.,
Thermodynamics of endo- and exo-dicyclopentadienes, their metathesis and addition polymerizations, and the resulting polymers,
Poly. Sci., Ser. A, 1997, 39, 8, 893. [all data]
Lenz and Vaughan, 1989
Lenz, T.G.; Vaughan, J.D.,
Employing force-field calculations to predict equilibrium constants and other thermodynamic properties for the dimerization of 1,3-cyclopentadiene,
J. Phys. Chem., 1989, 93, 1592-1596. [all data]