Cyclohexene, 3,5,5-trimethyl-
- Formula: C9H16
- Molecular weight: 124.2233
- IUPAC Standard InChIKey: CBERVMGFVLWZSU-UHFFFAOYSA-N
- CAS Registry Number: 933-12-0
- Chemical structure:
View 3d structure (requires JavaScript / HTML 5) - Other names: δ-Cyclogeraniolene; 3,5,5-Trimethylcyclohexene

Phase change data

Data compiled by: Thermodynamics Research Center, NIST Boulder Laboratories, Chris Muzny director
Quantity | Value | Units | Method | Reference | Comment |
---|---|---|---|---|---|
Tboil | 406.76 | K | N/A | Anonymous, 1951 | Uncertainty assigned by TRC = 0.2 K |
Tboil | 406.73 | K | N/A | Slomp, 1951 | Uncertainty assigned by TRC = 0.3 K |
Tboil | 406.73 | K | N/A | Boord, Greenlee, et al., 1950 | Uncertainty assigned by TRC = 0.3 K |
Quantity | Value | Units | Method | Reference | Comment |
Tfus | 181.9 | K | N/A | Anonymous, 1951 | Uncertainty assigned by TRC = 0.2 K |
Tfus | 181.18 | K | N/A | Boord, Greenlee, et al., 1950 | Uncertainty assigned by TRC = 0.3 K |

Normal alkane RI, non-polar column, temperature ramp

Column type | Active phase | I | Reference | Comment |
---|---|---|---|---|
Capillary | HP-5 | 1182. | Aghel, Yamini, et al., 2004 | 30. m/0.25 mm/0.32 μm, He, 60. C @ 3. min, 5. K/min; Tend: 250. C |

References

Anonymous, 1951
Anonymous, R.,
, Sunbury Rep. No. 4199, Anglo-Iranian Oil Co., 1951. [all data]
Slomp, 1951
Slomp, G.,
, Ph.D. Thesis, Ohio State Univ., Columbus, OH, 1951. [all data]
Boord, Greenlee, et al., 1950
Boord, C.E.; Greenlee, K.W.; Derfer, J.M.,
The Synthesis, Purification and Prop. of Hydrocarbons of Low Mol. Wt., Am. Pet. Inst. Res. Proj. 45, Twelfth Annu. Rep., Ohio State Univ., 1950. [all data]
Aghel, Yamini, et al., 2004
Aghel, N.; Yamini, Y.; Hadjiakhoondi, A.; Pourmortazavi, S.M.,
Supercritical carbon dioxide extraction of Mentha pulegium L. essential oil,
Talanta, 2004, 62, 2, 407-411, https://doi.org/10.1016/j.talanta.2003.08.011
. [all data]