1-Methylcyclooctene
- Formula: C9H16
- Molecular weight: 124.2233
- IUPAC Standard InChIKey: WFLPGXDWMZEHGP-CLFYSBASSA-N
- CAS Registry Number: 933-11-9
- Chemical structure:
View 3d structure (requires JavaScript / HTML 5) - Stereoisomers:
- Other names: Cyclooctene, 1-methyl; (Z)-Cyclooctene, 1-methyl

Kovats' RI, non-polar column, isothermal

Column type | Active phase | Temperature (C) | I | Reference | Comment |
---|---|---|---|---|---|
Packed | Squalane | 100. | 978. | Bogoslovsky, Anvaer, et al., 1978 | |
Packed | Squalane | 120. | 983. | Bogoslovsky, Anvaer, et al., 1978 | |
Packed | Squalane | 80. | 969. | Bogoslovsky, Anvaer, et al., 1978 | |
Capillary | Squalane | 100. | 978. | Schomburg, 1967 | Ar; Column length: 100. m |
Capillary | Squalane | 120. | 983. | Schomburg, 1966 | |
Capillary | Squalane | 80. | 969. | Schomburg, 1966 | |
Capillary | Squalane | 100. | 978. | Schomburg, 1966 | |
Packed | Apiezon L | 130. | 1023. | Wehrli and Kováts, 1959 | Celite; Column length: 2.25 m |

Normal alkane RI, non-polar column, custom temperature program

Column type | Active phase | I | Reference | Comment |
---|---|---|---|---|
Capillary | Squalane | 969. | Chen, 2008 | Program: not specified |

References

Bogoslovsky, Anvaer, et al., 1978
Bogoslovsky, Yu.N.; Anvaer, B.I.; Vigdergauz, M.S.,
Chromatographic constants in gas chromatography (in Russian), Standards Publ. House, Moscow, 1978, 192. [all data]
Schomburg, 1967
Schomburg, G.,
Struktur und Retentionsverhalten von Offenkettigen und Cyclischen Kohlenwasserstoffen und Deren Einfacher Substitutionsprodukte,
Anal. Chim. Acta., 1967, 38, 45-64, https://doi.org/10.1016/S0003-2670(01)80560-2
. [all data]
Schomburg, 1966
Schomburg, G.,
Gaschromatographische Retentionsdaten und struktur chemischer verbindungen. III. Alkylverzweigte und ungesättigte cyclische Kohlenwasserstoffe,
J. Chromatogr., 1966, 23, 18-41, https://doi.org/10.1016/S0021-9673(01)98653-4
. [all data]
Wehrli and Kováts, 1959
Wehrli, A.; Kováts, E.,
Gas-chromatographische Charakterisierung ogranischer Verbindungen. Teil 3: Berechnung der Retentionsindices aliphatischer, alicyclischer und aromatischer Verbindungen,
Helv. Chim. Acta, 1959, 7, 7, 2709-2736, https://doi.org/10.1002/hlca.19590420745
. [all data]
Chen, 2008
Chen, H.-F.,
Quantitative prediction of gas chromatography retention indices with support vector machines, radial basis neutral networks and multiple linear regression,
Anal. Chim. Acta, 2008, 609, 1, 24-36, https://doi.org/10.1016/j.aca.2008.01.003
. [all data]