2-cyclopentylacetamide
- Formula: C7H13NO
- Molecular weight: 127.1842
- IUPAC Standard InChIKey: OXRCIXHTUHZNRY-UHFFFAOYSA-N
- CAS Registry Number: 933-04-0
- Chemical structure:
View 3d structure (requires JavaScript / HTML 5) - Permanent link for this species. Use this link for bookmarking this species for future reference.

Phase change data

Data compiled by: Thermodynamics Research Center, NIST Boulder Laboratories, Chris Muzny director
Quantity | Value | Units | Method | Reference | Comment |
---|---|---|---|---|---|
Tfus | 419.2 | K | N/A | Seubold, 1954 | Uncertainty assigned by TRC = 2. K |

References

Seubold, 1954
Seubold, F.H.,
The cyclohexyl and cyclopentylmethyl radicals,
J. Am. Chem. Soc., 1954, 76, 3732. [all data]