Ethanone, 1-(1-cyclohexen-1-yl)-
- Formula: C8H12O
- Molecular weight: 124.1803
- IUPAC Standard InChIKey: LTYLUDGDHUEBGX-UHFFFAOYSA-N
- CAS Registry Number: 932-66-1
- Chemical structure:
View 3d structure (requires JavaScript / HTML 5) - Other names: Ketone, 1-cyclohexen-1-yl methyl; Methyl 1-cyclohexenyl ketone; 1-Acetylcyclohexene; 1-Cyclohexen-1-yl methyl ketone; 1-Acetyl-1-cyclohexene; 1-(1-Cyclohexen-1-yl)ethanone; cyclohex-1-enylmethylketone

Phase change data

Data compiled as indicated in comments:
BS - Robert L. Brown and Stephen E. Stein
TRC - Thermodynamics Research Center, NIST Boulder Laboratories, Chris Muzny director
Quantity | Value | Units | Method | Reference | Comment |
---|---|---|---|---|---|
Tboil | 474.7 | K | N/A | Weast and Grasselli, 1989 | BS |
Tboil | 475. | K | N/A | Wallach and Evans, 1908 | Uncertainty assigned by TRC = 7. K; TRC |
Quantity | Value | Units | Method | Reference | Comment |
Tfus | 346. | K | N/A | Buckingham and Donaghy, 1982 | BS |
Reduced pressure boiling point
Tboil (K) | Pressure (bar) | Reference | Comment |
---|---|---|---|
474. to 475. | 0.027 | Buckingham and Donaghy, 1982 | BS |

Van Den Dool and Kratz RI, non-polar column, temperature ramp

Column type | Active phase | I | Reference | Comment |
---|---|---|---|---|
Capillary | DB-5 | 1023. | Javidnia, Miri, et al., 2002 | He, 4. K/min; Column length: 25. m; Column diameter: 0.25 mm; Tstart: 70. C; Tend: 275. C |

Normal alkane RI, non-polar column, temperature ramp

Column type | Active phase | I | Reference | Comment |
---|---|---|---|---|
Capillary | SPB-1 | 931. | Vichi, Castellote, et al., 2003 | 30. m/0.25 mm/0.25 μm, He, 40. C @ 10. min, 3. K/min; Tend: 200. C |

References

Weast and Grasselli, 1989
CRC Handbook of Data on Organic Compounds, 2nd Editon, Weast,R.C and Grasselli, J.G., ed(s)., CRC Press, Inc., Boca Raton, FL, 1989, 1. [all data]
Wallach and Evans, 1908
Wallach, O.; Evans, E.,
Knowledge of Terpenes and Essential Oils I. Condensation of Cyclohexanone with α-Bromopropionic Acid,
Justus Liebigs Ann. Chem., 1908, 360, 44-50. [all data]
Buckingham and Donaghy, 1982
Buckingham, J.; Donaghy, S.M.,
Dictionary of Organic Compounds: Fifth Edition, Chapman and Hall, New York, 1982, 1. [all data]
Javidnia, Miri, et al., 2002
Javidnia, K.; Miri, R.; Safavi, F.; Azarpira, A.; Shafiee, A.,
Composition of the essential oil of Nepeta persica Boiss from Iran,
Flavour Fragr. J., 2002, 17, 1, 20-22, https://doi.org/10.1002/ffj.1023
. [all data]
Vichi, Castellote, et al., 2003
Vichi, S.; Castellote, A.I.; Pizzale, L.; Conte, L.S.; Buxaderas, S.; López-Tamames, E.,
Analysis of virgin olive oil volatile compounds by headspace solid-phase microextraction coupled to gas chromatography with mass spectrometric and flame ionization detection,
J. Chromatogr. A, 2003, 983, 1-2, 19-33, https://doi.org/10.1016/S0021-9673(02)01691-6
. [all data]