1,4-Cyclopentadiene-1,2,3,4-tetracarboxylic acid, 3-chloro-5-methyl-, tetramethyl ester
- Formula: C14H15ClO8
- Molecular weight: 346.717
- CAS Registry Number: 93251-35-5

Reaction thermochemistry data

Data compiled by: Hussein Y. Afeefy, Joel F. Liebman, and Stephen E. Stein
Individual Reactions
C14H15ClO8 = C14H15ClO8
By formula: C14H15ClO8 = C14H15ClO8
Quantity | Value | Units | Method | Reference | Comment |
---|---|---|---|---|---|
ΔrH° | -4. ± 1. | kJ/mol | Eqk | Mikhailov, Dushenko, et al., 1994 | liquid phase; solvent: o-Dichlorobenzene |

References

Mikhailov, Dushenko, et al., 1994
Mikhailov, I.E.; Dushenko, G.A.; Kisin, A.V.; Mugge, C.; Zschunke, A.; Minkin, V.I.,
1,5-Sigmatropic shifts of chlorine in the cyclopentadiene ring,
Mendeleev Commun., 1994, 85-88. [all data]