trans-1-Methyl-2-propylcyclopentane
- Formula: C9H18
- Molecular weight: 126.2392
- IUPAC Standard InChIKey: ADQJFBQXLAAVQA-IUCAKERBSA-N
- CAS Registry Number: 932-44-5
- Chemical structure:
View 3d structure (requires JavaScript / HTML 5) - Stereoisomers:
- Other names: 1-trans-2-methylpropylcyclopentane; Cyclopentane, 1-methyl-2-propyl-, trans-; 1-Methyl-2-propylcyclopentane, trans

Phase change data

Data compiled by: Thermodynamics Research Center, NIST Boulder Laboratories, Chris Muzny director
Quantity | Value | Units | Method | Reference | Comment |
---|---|---|---|---|---|
Tfus | 150. | K | N/A | Chiurdoglu, 1934 | Uncertainty assigned by TRC = 2. K |

Kovats' RI, non-polar column, isothermal

View large format table.

Column type Active phase Temperature (C) I Reference Comment
CapillarySqualane50.881.4Lunskii and Paizanskaya, 1988He; Column length: 50. m; Column diameter: 0.22 mm
CapillarySqualane70.885.1Lunskii and Paizanskaya, 1988He; Column length: 50. m; Column diameter: 0.22 mm
PackedSqualane100.922.Bogoslovsky, Anvaer, et al., 1978
PackedSqualane120.927.Bogoslovsky, Anvaer, et al., 1978
PackedSqualane60.913.Bogoslovsky, Anvaer, et al., 1978
PackedSqualane80.918.Bogoslovsky, Anvaer, et al., 1978
CapillarySqualane100.886.6Lulova, Leont'eva, et al., 1976He; Column length: 120. m; Column diameter: 0.25 mm
CapillarySqualane100.892.Dielmann, Schwengers, et al., 1974Column length: 100. m; Column diameter: 0.25 mm
CapillarySqualane120.896.Dielmann, Schwengers, et al., 1974Column length: 100. m; Column diameter: 0.25 mm
CapillarySqualane60.884.Dielmann, Schwengers, et al., 1974Column length: 100. m; Column diameter: 0.25 mm
CapillarySqualane80.888.Dielmann, Schwengers, et al., 1974Column length: 100. m; Column diameter: 0.25 mm

References

Chiurdoglu, 1934
Chiurdoglu, G.,
The stereoisomers of 1-methyl-2-propylcyclopentane,
Bull. Soc. Chim. Belg., 1934, 43, 35-48. [all data]